{"text_format":"1","workbook":"xlsx","n_sheets":15,"sheets":["Revision history","Reference Tables","City information","Data sources","Emission factors","I - Stationary","II - Transport","III - Waste","IV - IPPU","V - AFOLU","VI - Other scope 3","Table A. Overview","Graphs","Table B. Summary","Lists"],"not_rendered":{"charts":6,"images":1,"macros":1,"external_links":8,"defined_names":116,"comments":2,"pivot_tables":0},"unopened":[],"bounds":{"document_bytes":16777216,"sheet_cells":100000,"rows_first":2000,"rows_last":500,"rows_between":2000,"halvings":0,"cell_chars":16384,"cell_head_chars":4096},"cells_cut":0,"cells_raw":0,"read":"whole","date_system":"1900"}

{"sheet":"Revision history","index":0,"n_rows":14,"n_cols":6,"rows_kept":14,"cut":false,"hidden":false,"merged":[[7,1,14,1]]}
[]
[null,"REVISION HISTORY"]
[]
[null,"Version / Revision","Sheet","Change","Date","Name"]
[]
[null,"1.0_ENG",null,"Created reporting tool","May 2015","Michael Doust"]
[null,"1.8_ENG","Various","Integrated AD*EF calculation functionality","June 2015","Michael Doust"]
[null,"1.9_ENG","City information","Updated to expand reporting of renewable energy production or investments","2015-09-21","Michael Doust"]
[null,null,"Data sources and Emission factors","Increased list from 10 to 20 entries. Option to add row maintained","2015-09-21","Michael Doust"]
[null,null,"Emission factors","Added emission factor for calculating fugitive losses from gas distribution using default IPCC values","2015-09-21","Michael Doust"]
[null,null,"Table B. Summary","Added \"BASIC+ S3\" and \"Net GHGs\" columns to summary table","2015-09-21","Michael Doust"]
[null,null,"Wastewater","New sheet added to calculate emissions from wastewater using default IPCC values","In progress","Michael Doust"]
[null,null,"Notation keys","Entered default 'NE' notation keys for all BASIC+ activities and 'NO' for I.5, I.6, I.7, II.4.2 and II.5.3","2015-09-21","Michael Doust"]
[null,null,"Various","Minor spelling corrections and updated dropdown lists","2015-09-21","Michael Doust"]

{"sheet":"Reference Tables","index":1,"n_rows":158,"n_cols":15,"rows_kept":158,"cut":false,"hidden":false,"merged":[[18,1,18,4],[19,1,19,4],[20,1,20,4],[101,1,101,2],[90,1,90,2],[92,1,92,2],[93,1,93,2],[95,1,95,2],[96,1,96,2],[97,1,97,2],[21,1,21,4],[22,1,22,4],[33,1,33,4],[34,1,34,4],[37,1,37,4],[36,1,36,4],[24,1,24,4],[25,1,25,4],[26,1,26,4],[27,1,27,4],[38,1,38,4],[89,1,89,2],[89,3,89,4],[88,1,88,2],[5,1,5,4],[7,1,7,4],[8,1,8,4],[9,1,9,4],[10,1,10,4],[11,1,11,4],[12,1,12,4],[13,1,13,4],[14,1,14,4],[86,3,86,4],[87,3,87,4],[88,3,88,4],[87,1,87,2],[122,4,123,4],[133,4,134,4],[83,5,83,8],[103,1,103,2],[104,1,104,2],[145,9,146,9],[112,1,113,1],[112,3,113,3],[112,4,113,4],[112,5,113,5],[112,6,113,6],[112,7,113,7],[122,3,123,3],[122,1,123,1],[122,5,123,5],[122,6,123,6],[122,7,123,7],[145,1,146,1],[145,3,146,3],[145,4,146,4],[145,5,146,5],[145,6,146,6],[145,7,146,7],[145,8,146,8],[133,6,134,6],[133,7,134,7],[133,9,134,9],[52,11,53,13],[52,14,53,19],[122,8,123,8],[133,1,134,1],[133,3,134,3],[133,5,134,5],[83,1,83,4],[84,1,84,2],[84,3,84,4],[86,1,86,2],[104,3,104,4],[91,1,91,2],[94,1,94,2],[102,1,102,2],[98,1,98,2],[99,1,99,2],[100,1,100,2],[73,14,74,19],[75,14,76,19],[77,14,78,19],[67,14,68,19],[69,14,70,19],[71,14,72,19],[133,8,134,8],[63,14,64,19],[55,14,56,19],[55,13,56,13],[57,14,58,19],[59,14,60,19],[61,14,62,19],[65,14,66,19],[61,13,62,13],[67,13,68,13],[75,13,78,13],[73,13,74,13],[55,11,56,12],[61,11,62,12],[67,11,68,12],[73,11,74,12],[57,13,60,13],[63,13,66,13],[69,13,72,13]]}
[]
[null,"REFERENCE TABLES"]
[]
[null,"A. GPC OVERVIEW "]
[]
[null,"Sectors and sub-sectors",null,null,null,null,null,null,"Scope 1","Scope 2","Scope 3"]
[null,"STATIONARY ENERGY"]
[null,"Residential buildings",null,null,null,null,null,null,"a","a","a"]
[null,"Commercial buildings",null,null,null,null,null,null,"a","a","a"]
[null,"Institutional buildings",null,null,null,null,null,null,"a","a","a"]
[null,"Manufacturing industries and construction",null,null,null,null,null,null,"a","a","a"]
[null,"Energy industries",null,null,null,null,null,null,"a","a","a"]
[null,"Energy generation supplied to the grid",null,null,null,null,null,null,"a"]
[null,"Agriculture, forestry, and fishing activities ",null,null,null,null,null,null,"a","a","a"]
[null,"Non-specified sources",null,null,null,null,null,null,"a","a","a"]
[null,"Fugitive emissions from mining, processing, storage, and transportation of coal",null,null,null,null,null,null,"a"]
[null,"Fugitive emissions from oil and natural gas systems",null,null,null,null,null,null,"a"]
[null,"TRANSPORTATION"]
[null,"On-road",null,null,null,null,null,null,"a","a","a"]
[null,"Railways",null,null,null,null,null,null,"a","a","a"]
[null,"Waterborne navigation",null,null,null,null,null,null,"a","a","a"]
[null,"Aviation",null,null,null,null,null,null,"a","a","a"]
[null,"Off-road",null,null,null,null,null,null,"a","a"]
[null,"WASTE"]
[null,"Solid waste generated in the city",null,null,null,null,null,null,"a",null,"a"]
[null,"Solid waste generated outside the city",null,null,null,null,null,null,"a"]
[null,"Biological waste generated in the city",null,null,null,null,null,null,"a",null,"a"]
[null,"Biological waste generated outside the city",null,null,null,null,null,null,"a"]
[null,"Incinerated and burned waste generated in the city",null,null,null,null,null,null,"a",null,"a"]
[null,"Incinerated and burned waste generated outside city  ",null,null,null,null,null,null,"a"]
[null,"Wastewater generated in the city ",null,null,null,null,null,null,"a",null,"a"]
[null,"Wastewater generated outside the city",null,null,null,null,null,null,"a"]
[null,"INDUSTRIAL PROCESSES AND PRODUCT USE (IPPU)"]
[null,"Industrial processes",null,null,null,null,null,null,"a"]
[null,"Product use",null,null,null,null,null,null,"a"]
[null,"AGRICULTURE, FORESTRY, AND LAND USE (AFOLU)"]
[null,"Livestock",null,null,null,null,null,null,"a"]
[null,"Land",null,null,null,null,null,null,"a"]
[null,"Other agriculture",null,null,null,null,null,null,"a"]
[null,"OTHER SCOPE 3"]
[]
[null,"a",{"$f":"\"= sources required for reporting\"","v":"= sources required for reporting"}]
[null,"a",{"$f":"\"= sources required for BASIC reporting\"","v":"= sources required for BASIC reporting"}]
[null,"a",{"$f":"\" +\"","v":" +"},"a",{"$f":"\"= sources required for BASIC+ reporting\"","v":"= sources required for BASIC+ reporting"}]
[null,"a",{"$f":"\"= additional scope 1 sources required for territorial reporting\"","v":"= additional scope 1 sources required for territorial reporting"}]
[null,null,{"$f":"\"= other scope 3 sources\"","v":"= other scope 3 sources"}]
[null,null,{"$f":"\"= non-applicable emission sources\"","v":"= non-applicable emission sources"}]
[]
[null,"B. NOTATION KEYS"]
[]
[null,"B1. When to use notation keys?",null,null,null,null,null,null,null,null,null,"B2. Definitions"]
[]
[null,null,null,null,null,null,null,null,null,null,null,"Notation key",null,null,"Description and examples"]
[]
[]
[null,null,null,null,null,null,null,null,null,null,null,"Not occurring",null,"NO","An activity or process does not occur or exist within the city."]
[]
[null,null,null,null,null,null,null,null,null,null,null,null,null,"Example","I.7.1 does not occur. No coal-related activities within the city boundary."]
[]
[null,null,null,null,null,null,null,null,null,null,null,null,null,null,"II.2.2 does not occur. Number of electric vehicles is negligible compared to total vehicle fleet (0.01% of vehicle sales in 2014 were electric)."]
[]
[null,null,null,null,null,null,null,null,null,null,null,"Included elsewhere",null,"IE","GHG emissions for this activity are estimated and presented in another category of the inventory. That category shall be noted in the explanation."]
[]
[null,null,null,null,null,null,null,null,null,null,null,null,null,"Example","II.5.1 is reported in II.1.1. Fuel sales approach does not allow for disaggregation."]
[]
[null,null,null,null,null,null,null,null,null,null,null,null,null,null,"III.1.2 is reported in I Stationary. Landfill gas is captured and burned as an energy source."]
[]
[null,null,null,null,null,null,null,null,null,null,null,"Not estimated",null,"NE","Emissions occur but have not been estimated or reported; justification for exclusion shall be noted in the explanation"]
[]
[null,null,null,null,null,null,null,null,null,null,null,null,null,"Example","III.4.3 has not been estimated. Activity not required for BASIC inventory."]
[]
[null,null,null,null,null,null,null,null,null,null,null,null,null,null,"V.1 has not been estimated. No livetstock data available."]
[]
[null,null,null,null,null,null,null,null,null,null,null,"Confidential",null,"C","GHG emissions which could lead to the disclosure of confidential information and can therefore not be reported."]
[]
[null,null,null,null,null,null,null,null,null,null,null,null,null,"Example","Activity data for IV.1 is confidential. Data cannot be aggregated to provide confidentiality."]
[]
[null,null,null,null,null,null,null,null,null,null,null,null,null,null,"II.5.1 is confidential. Military base within city boundary. "]
[]
[]
[]
[null,"C. GLOBAL WARMING POTENTIAL"]
[]
[null,"Greenhouse gas ",null,null,null,"IPCC Assessment Report"]
[null,"Formula",null,"Name",null,"5AR","4AR","3AR","2AR"]
[]
[null,"CO2",null,"Carbon Dioxide",null,1,1,1,1]
[null,"CH4",null,"Methane",null,28,25,23,21]
[null,"N2O",null,"Nitrous Oxide",null,265,298,296,310]
[null,"SF6",null,"Sulphur hexafluoride",null,23500,22800,22200,23900]
[null,"CF4",null,"Carbon tetrafluoride",null,6630,7390,5700,6500]
[null,"C2F6",null,"Hexafluoroethane",null,11100,12200,11900,9200]
[null,"CHF3",null,"HFC-23",null,12400,14800,12000,11700]
[null,"CH2F2",null,"HFC-32",null,677,675,550,650]
[null,"CH3F",null,"HFC-41",null,116,92,97,150]
[null,"C2HF5",null,"HFC-125",null,3170,3500,3400,2800]
[null,"C2H2F4",null,"HFC-134",null,1120,1100,1100,1000]
[null,"CH2FCF3",null,"HFC-134a",null,1300,1430,1300,1300]
[null,"C2H3F3",null,"HFC-143",null,328,353,330,300]
[null,"C2H4F3",null,"HFC-143a",null,4800,4470,4300,3800]
[null,"C2H4F2",null,"HFC-152a",null,138,124,120,140]
[null,"C3HF7",null,"HFC-227ea",null,3350,3220,3500,2900]
[null,"C3H2F6",null,"HFC-236fa",null,8060,9810,9400,6300]
[null,"C3H3F5",null,"HFC-245ca",null,716,1030,950,560]
[null,"NF3",null,"Nitrogen trifluoride",null,16100,17200]
[]
[null,"Full references to the IPCC Assessment Reports are provided in the GPC"]
[]
[null,"D. CONVERSION FACTORS"]
[]
[null,"Conversion factors for SI prefixes"]
[]
[null,"From",null,"To","T","G","M","k"]
[]
[null,"Multiply by:"]
[null,"Tera (T) - 1000000000000, 1012",null,null,1,1000,1000000,1000000000]
[null,"Giga (G) - 1000000000, 109",null,null,1E-3,1,1000,1000000]
[null,"Mega (M) - 1000000, 106",null,null,9.9999999999999995E-7,1E-3,1,1000]
[null,"Kilo (k) - 1000, 103",null,null,1.0000000000000001E-9,9.9999999999999995E-7,1E-3,1]
[]
[null,"General conversion factors for energy"]
[]
[null,"From",null,"To","TJ","Gcal","Mtoe","Mbtu","GWh"]
[]
[null,"Multiply by:"]
[null,"Terajoules(TJ)",null,null,1,238.8,2.3879999999999998E-5,947.8,0.27779999999999999]
[null,"Giga calories (Gcal)",null,null,4.1868000000000001E-3,1,9.9999999999999995E-8,3.968,1.163E-3]
[null,"Mtoe",null,null,41868,10000000,1,39680000,11630]
[null,"Mbtu",null,null,1.0551E-3,0.252,2.5200000000000001E-8,1,2.9310000000000002E-4]
[null,"Gigawatt hours (GWh)",null,null,3.6,860,8.6000000000000003E-5,3412,1]
[]
[null,"General conversion factors for mass"]
[]
[null,"From",null,"To","g","kg","t","lt","st","lb"]
[]
[null,"Multiply by:"]
[null,"gramme (g)",null,"g",{"$f":"F137*1000","v":1},{"$f":"F138/1000","v":1E-3},{"$f":"G138/1000","v":9.9999999999999995E-7},{"$f":"H138/1000","v":9.8400000000000002E-7},{"$f":"I138/1000","v":1.102E-6},{"$f":"J138/1000","v":2.20462262E-3}]
[null,"Kilogramme (kg)",null,"kg",1000,1,1E-3,9.8400000000000007E-4,1.1019999999999999E-3,2.2046226199999999]
[null,"Metric tonne (t)",null,"t",1000000,1000,1,0.98399999999999999,1.1023000000000001,{"$f":"J138*F139","v":2204.6226199999996}]
[null,"Long ton (lt)",null,"lt",1016000,1016,1.016,1,1.1200000000000001,2240]
[null,"Short ton (st)",null,"st",907200,907.2,0.90720000000000001,0.89300000000000002,1,2000]
[null,"Pound (lb)",null,"lb",453.59237038037833,{"$f":"1/J138","v":0.45359237038037831},{"$f":"1/J139","v":4.5359237038037839E-4},{"$f":"1/J140","v":4.4642857142857141E-4},{"$f":"1/J141","v":5.0000000000000001E-4},1]
[]
[null,"General conversion factors for volume"]
[]
[null,"From",null,"To","l","m3","ft3","bbl","UK gal","US gal"]
[]
[null,"Multiply by:"]
[null,"Litre (l)",null,null,1,1E-3,3.5299999999999998E-2,6.3E-3,0.22,{"$f":"1/E154","v":0.26420079260237778}]
[null,"Cubic metre (m3)",null,null,{"$f":"E149*1000","v":1000},1,{"$f":"G149*1000","v":35.299999999999997},{"$f":"H149*1000","v":6.3},{"$f":"I149*1000","v":220},{"$f":"J149*1000","v":264.20079260237776}]
[null,"Cubic foot (ft3)",null,null,"28.3",2.8299999999999999E-2,1,0.17810000000000001,6.2290000000000001,"7.48"]
[null,"Barrel (bbl)",null,null,159,0.159,5.6150000000000002,1,34.97,42]
[null,"UK gallon (gal)",null,null,4.5460000000000003,4.4999999999999997E-3,0.1605,2.8590000000000001E-2,1,1.2010000000000001]
[null,"US gallon (gal)",null,null,3.7850000000000001,3.8E-3,0.13370000000000001,2.3810000000000001E-2,0.8327,1]
[]
[null,"Source: International Energy Agency: www.iea.org/newsroomandevents/resources/conversiontables"]
[]
[null,"A more complete list of conversions is available at www.onlineconversion.com"]

{"sheet":"City information","index":2,"n_rows":90,"n_cols":11,"rows_kept":90,"cut":false,"hidden":false,"merged":[[82,1,83,1],[62,1,63,1],[71,1,72,1],[51,2,51,3],[51,4,51,5],[71,2,72,2],[62,2,63,2],[51,1,52,1],[44,2,44,3],[5,4,6,5],[13,4,13,5],[12,4,12,5],[23,1,23,5],[37,1,38,1],[13,2,13,3],[14,2,14,3],[15,2,15,3],[16,2,16,3],[8,4,8,5],[8,2,8,3],[9,2,9,3],[10,2,10,3],[29,2,29,5],[30,2,30,5],[7,1,7,5],[5,1,6,1],[41,2,41,3],[21,1,22,1],[5,2,6,3],[37,2,38,3],[40,2,40,3],[31,2,31,5],[32,2,32,5],[33,2,33,5],[24,2,24,5],[25,2,25,5],[26,2,26,5],[27,2,27,5],[28,2,28,5],[42,2,42,3],[43,2,43,3],[11,4,11,5],[10,4,10,5],[9,4,9,5],[17,2,17,3],[17,4,17,5],[16,4,16,5],[15,4,15,5],[14,4,14,5],[21,2,22,5],[11,2,11,3],[12,2,12,3],[45,2,45,3],[82,9,83,9],[82,10,83,10],[82,2,82,3],[82,4,83,4],[82,7,82,8],[51,6,52,6],[82,6,83,6],[82,5,83,5]]}
[]
[null,"CITY INFORMATION"]
[]
[null,"A. INVENTORY BOUNDARY (GPC table 4.1 page 40)"]
[]
[null,"Boundary","Information",null,"Reference(s)"]
[]
[]
[null,"Name of city","Chicago"]
[null,"Country","USA"]
[null,"Inventory year (if not calendar year, please specify the full 12-month period, e.g. 01 April 2014 - 31 March 2015)",2010]
[null,"Geographic boundary (select from list of values)","Administrative boundary of a local government ",null,"Please provide a description of the boundary or reference to an official source"]
[null,"Land area (km2) within city boundary"]
[null,"Resident population within city boundary",2695598,null,"U.S Census Bureau"]
[null,"GDP (US$) of economic activity within city boundary"]
[null,"Predominant type of economy (select from list of values)"]
[null,"Climate (select from list of values)",null,null,"http://people.eng.unimelb.edu.au/mpeel/koppen.html"]
[null,"Other information"]
[]
[null,"B. INVENTORY INFORMATION"]
[]
[null,"Inventory","Information"]
[]
[]
[null,"GPC reporting level (select from list)","BASIC"]
[null,"Greenhouse gases included in inventory (select from list)","CO2, CH4, N2O"]
[null,"Global Warming Potential (select relevant IPCC AR from list)","IPCC Second Assessment Report (1995)"]
[null,"Description of overall methodology and tools used"]
[null,"Relevant local, regional and national regulations"]
[null,"Comments on change in total emissions since last reported inventory"]
[null,"Has the inventory been audited or verified by a third party?","Please select"]
[null,{"$f":"IF(C31=\"Yes - audited\",\"Name of auditor\",IF(C31=\"Yes - verified\",\"Name of verifier\",\"\"))","v":""}]
[null,{"$f":"IF(C31=\"Yes - audited\",\"Year of audit\",IF(C31=\"Yes - verified\",\"Year of verification\",\"\"))","v":""}]
[null,"Planned improvements"]
[]
[null,"C. INVENTORY COMPILER"]
[]
[null,null,"Information"]
[]
[]
[null,"Compiler name"]
[null,"Department"]
[null,"Date"]
[null,"Version"]
[null,"Contact information"]
[null,"Links"]
[]
[null,"D. OPTIONAL INFORMATION ITEMS (GPC section 4.3 page 40)"]
[]
[null,"D1. Scope 2 emissions based on market-based method"]
[]
[null,"Contractual instrument or program type","Quantity of energy (kWh, BTU , etc.)",null,"Emission factor conveyed by the instrument",null,"Total GHG emissions (tCO2e)"]
[null,null,"Amount","Units","Amount","Units"]
[]
[]
[]
[]
[]
[null,"TOTAL market-based scope 2 emissions (in tCO2e)",null,null,null,null,{"$f":"IF(SUM(G55:G58)=0,0,SUM(G55:G58))","v":0}]
[]
[null,"D2. Offset credit transactions"]
[]
[null,"Offset credits generated within the\n geographic boundary and sold","Total GHG emissions (tCO2e)"]
[]
[]
[]
[]
[]
[]
[null,"TOTAL inboundary offset credit transactions (in tCO2e)",{"$f":"IF(SUM(C66:C69)=0,0,SUM(C66:C69))","v":0}]
[]
[null,"Offset credits purchased from outside the geographic \nboundary (e.g. to meet a city reduction goal)","Total GHG emissions (tCO2e)"]
[]
[]
[]
[]
[]
[]
[null,"TOTAL out of boundary offset credit transactions (in tCO2e)",{"$f":"IF(SUM(C75:C78)=0,0,SUM(C75:C78))","v":0}]
[]
[null,"D3. Renewable energy production or investments"]
[]
[null,"Technology type","Total annual production of grid-delivered energy",null,"Located in geographic boundary?","If outside boundary, percentage\nof ownership by city?","Benchmark energy source","Emission factor",null,"Correction (tCO2e)","Total GHG emissions (tCO2e)"]
[null,null,"Amount","Units",null,null,null,"Amount","Units"]
[]
[null,null,null,null,null,null,null,null,null,null,{"$f":"IF(ISNUMBER(F86),F86*C86*H86-J86,C86*H86-J86)","v":0}]
[null,null,null,null,null,null,null,null,null,null,{"$f":"IF(ISNUMBER(F87),F87*C87*H87-J87,C87*H87-J87)","v":0}]
[null,null,null,null,null,null,null,null,null,null,{"$f":"IF(ISNUMBER(F88),F88*C88*H88-J88,C88*H88-J88)","v":0}]
[null,null,null,null,null,null,null,null,null,null,{"$f":"IF(ISNUMBER(F89),F89*C89*H89-J89,C89*H89-J89)","v":0}]
[null,"TOTAL renewable energy production or investments (in tCO2e)",null,null,null,null,null,null,null,null,{"$f":"IF(SUM(K86:K89)=0,0,SUM(K86:K89))","v":0}]

{"sheet":"Data sources","index":3,"n_rows":30,"n_cols":11,"rows_kept":30,"cut":false,"hidden":false,"merged":[[5,8,6,8],[5,10,6,10],[5,7,6,7],[5,1,6,1],[5,2,6,2],[5,9,6,9],[5,4,6,4],[5,5,6,5],[5,6,6,6],[5,3,6,3]]}
[]
[null,"DATA SOURCES"]
[]
[null,"Use this table to record all the data sources used to compile the inventory. References provided in column C may be used to select the relevant data sources in the emission factors and sector tabs."]
[]
[null,"Data","Name of source","Provider","Reporting period","Frequency","Release date","Scale","Available from","Latest year","Link"]
[]
[null,"Emission factors","National emissions factor database","Ministry of the Environment","Calendar year","Annual","April","National",2000,2014,"www.ipcc-nggip.iges.or.jp/EFDB/main.php"]
[]
[]
[]
[]
[]
[]
[]
[]
[]
[]
[]
[]
[]
[]
[]
[]
[]
[]
[]
[]
[]
[null,"VIII. MACRO"]

{"sheet":"Emission factors","index":4,"n_rows":42,"n_cols":73,"rows_kept":42,"cut":false,"hidden":false,"merged":[[6,72,7,72],[6,71,7,71],[6,3,7,3],[6,9,6,67],[6,5,7,7],[6,8,7,8],[3,65,4,65],[6,1,7,1],[6,70,7,70],[6,69,7,69],[6,2,7,2],[6,4,7,4],[44,23,44,24],[45,23,45,24],[46,23,46,24],[47,23,47,24],[48,23,48,24],[54,23,54,24],[55,23,55,24],[49,23,49,24],[50,23,50,24],[51,23,51,24],[52,23,52,24],[53,23,53,24]]}
[]
[null,"EMISSION FACTORS",null,null,null,null,null,null,null,null,null,null,null,null,null,null,null,null,null,null,null,null,null,null,null,null,null,null,null,null,null,null,null,null,null,null,null,null,null,null,null,null,null,null,null,null,null,null,null,null,null,null,null,null,null,null,null,null,null,null,null,null,null,null,null,""]
[]
[null,"Use this table to record the emission factors used to calculate GHG emissions from all the activities included in the inventory. ",null,null,null,null,null,null,null,null,null,null,null,null,null,null,null,null,null,null,null,null,null,null,null,null,null,null,null,null,null,null,null,null,null,null,null,null,null,null,null,null,null,null,null,null,null,null,null,null,null,null,null,null,null,null,null,null,null,null,null,null,null,null,null,"F gases"]
[null,"References provided in column D shall be used to identify the relevant emission factors in the sector tabs."]
[]
[null,"Fuel type or activity","Reference","Type","GWP","Units",null,null,"Convert to tonnes","Emission factor",null,null,null,null,null,null,null,null,null,null,null,null,null,null,null,null,null,null,null,null,null,null,null,null,null,null,null,null,null,null,null,null,null,null,null,null,null,null,null,null,null,null,null,null,null,null,null,null,null,null,null,null,null,null,null,null,null,null,null,"Year","Scale","Description","Source"]
[null,null,null,null,null,null,null,null,null,"CO2","tCO2e","CH4","CH4_CO2e","CH4_tCO2e","N2O","N2O_CO2e","N2O_tCO2e","CF4","CF4_CO2e","CF4_tCO2e","C2F6","C2F6_CO2e","C2F6_tCO2e","HFC-23","HFC-23_CO2e","HFC-23_tCO2e","HFC-32","HFC-32_CO2e","HFC-32_tCO2e","HFC-41","HFC-41_CO2e","HFC-41_tCO2e","HFC-125","HFC-125_CO2e","HFC-125_tCO2e","HFC-134","HFC-134_CO2e","HFC-134_tCO2e","HFC-134a","HFC-134a_CO2e","HFC-134a_tCO2e","HFC-143","HFC-143_CO2e","HFC-143_tCO2e","HFC-143a","HFC-143a_CO2e","HFC-143a_tCO2e","HFC-152a","HFC-152a_CO2e","HFC-152a_tCO2e","HFC-227ea","HFC-227ea_CO2e","HFC-227ea_tCO2e","HFC-236fa","HFC-236fa_CO2e","HFC-236fa_tCO2e","HFC-245ca","HFC-245ca_CO2e","HFC-245ca_tCO2e","SF6","SF6_CO2e","SF6_tCO2e","NF3","NF3_CO2e","NF3_tCO2e","Total CO2e","tCO2e","CO2(b)","tCO2(b)"]
[null,"Fuel A","EF_Fuel A","CO2e","5AR","kg","/","kWh",1E-3,0.48220000000000002,{"$f":"J9*$I9","v":4.8220000000000001E-4},3.0000000000000001E-3,{"$f":"IF(L9=\"\",\"\",IF($D9=\"\",L9,IF($D9=\"CO2e\",L9,L9*HLOOKUP($E9,'Reference Tables'!$F$85:$I$105,4,FALSE))))","v":3.0000000000000001E-3},{"$f":"M9*$I9","v":3.0000000000000001E-6},2.8999999999999998E-3,{"$f":"IF(O9=\"\",\"\",IF($D9=\"\",O9,IF($D9=\"CO2e\",O9,O9*HLOOKUP($E9,'Reference Tables'!$F$85:$I$105,5,FALSE))))","v":2.8999999999999998E-3},{"$f":"P9*$I9","v":2.8999999999999998E-6},null,null,null,null,null,null,null,null,null,null,null,null,null,null,null,null,null,null,null,null,null,null,null,null,null,null,null,null,null,null,null,null,null,null,null,null,null,null,null,null,null,null,null,null,null,null,null,null,null,null,0,null,2014,"National","Average emission factor for national electricity grid","National emissions factor database"]
[]
[null,"Fugitive emissions from gas distribution","EF_Fugitive","GHG","4AR","kg",{"$f":"IF(F11=\"\",\"\",\"/\")","v":"/"},"m3",{"$f":"IFERROR(IF(F11=\"\",\"\",VLOOKUP(F11,'Reference Tables'!$D$137:$G$142,4,FALSE)),\"\")","v":1E-3},5.1E-5,{"$f":"IFERROR(IF(J11=\"\",\"\",J11*$I11),\"\")","v":5.1E-8},1.1000000000000001E-3,{"$f":"IF(L11=\"\",\"\",IF($D11=\"\",L11,IF($D11=\"CO2e\",L11,L11*HLOOKUP($E11,'Reference Tables'!$F$85:$I$105,4,FALSE))))","v":2.75E-2},{"$f":"IFERROR(IF(M11=\"\",\"\",M11*$I11),\"\")","v":2.7500000000000001E-5},null,{"$f":"IF(O11=\"\",\"\",IF($D11=\"\",O11,IF($D11=\"CO2e\",O11,O11*HLOOKUP($E11,'Reference Tables'!$F$85:$I$105,5,FALSE))))","v":""},{"$f":"IFERROR(IF(P11=\"\",\"\",P11*$I11),\"\")","v":""},null,{"$f":"IF(R11=\"\",\"\",IF($D11=\"\",R11,IF($D11=\"CO2e\",R11,R11*HLOOKUP($E11,'Reference Tables'!$F$85:$I$105,7,FALSE))))","v":""},{"$f":"IFERROR(IF(S11=\"\",\"\",S11*$I11),\"\")","v":""},null,{"$f":"IF(U11=\"\",\"\",IF($D11=\"\",U11,IF($D11=\"CO2e\",U11,U11*HLOOKUP($E11,'Reference Tables'!$F$85:$I$105,8,FALSE))))","v":""},{"$f":"IFERROR(IF(V11=\"\",\"\",V11*$I11),\"\")","v":""},null,{"$f":"IF(X11=\"\",\"\",IF($D11=\"\",X11,IF($D11=\"CO2e\",X11,X11*HLOOKUP($E11,'Reference Tables'!$F$85:$I$105,9,FALSE))))","v":""},{"$f":"IFERROR(IF(Y11=\"\",\"\",Y11*$I11),\"\")","v":""},null,{"$f":"IF(AA11=\"\",\"\",IF($D11=\"\",AA11,IF($D11=\"CO2e\",AA11,AA11*HLOOKUP($E11,'Reference Tables'!$F$85:$I$105,10,FALSE))))","v":""},{"$f":"IFERROR(IF(AB11=\"\",\"\",AB11*$I11),\"\")","v":""},null,{"$f":"IF(AD11=\"\",\"\",IF($D11=\"\",AD11,IF($D11=\"CO2e\",AD11,AD11*HLOOKUP($E11,'Reference Tables'!$F$85:$I$105,11,FALSE))))","v":""},{"$f":"IFERROR(IF(AE11=\"\",\"\",AE11*$I11),\"\")","v":""},null,{"$f":"IF(AG11=\"\",\"\",IF($D11=\"\",AG11,IF($D11=\"CO2e\",AG11,AG11*HLOOKUP($E11,'Reference Tables'!$F$85:$I$105,12,FALSE))))","v":""},{"$f":"IFERROR(IF(AH11=\"\",\"\",AH11*$I11),\"\")","v":""},null,{"$f":"IF(AJ11=\"\",\"\",IF($D11=\"\",AJ11,IF($D11=\"CO2e\",AJ11,AJ11*HLOOKUP($E11,'Reference Tables'!$F$85:$I$105,13,FALSE))))","v":""},{"$f":"IFERROR(IF(AK11=\"\",\"\",AK11*$I11),\"\")","v":""},null,{"$f":"IF(AM11=\"\",\"\",IF($D11=\"\",AM11,IF($D11=\"CO2e\",AM11,AM11*HLOOKUP($E11,'Reference Tables'!$F$85:$I$105,14,FALSE))))","v":""},{"$f":"IFERROR(IF(AN11=\"\",\"\",AN11*$I11),\"\")","v":""},null,{"$f":"IF(AP11=\"\",\"\",IF($D11=\"\",AP11,IF($D11=\"CO2e\",AP11,AP11*HLOOKUP($E11,'Reference Tables'!$F$85:$I$105,15,FALSE))))","v":""},{"$f":"IFERROR(IF(AQ11=\"\",\"\",AQ11*$I11),\"\")","v":""},null,{"$f":"IF(AS11=\"\",\"\",IF($D11=\"\",AS11,IF($D11=\"CO2e\",AS11,AS11*HLOOKUP($E11,'Reference Tables'!$F$85:$I$105,16,FALSE))))","v":""},{"$f":"IFERROR(IF(AT11=\"\",\"\",AT11*$I11),\"\")","v":""},null,{"$f":"IF(AV11=\"\",\"\",IF($D11=\"\",AV11,IF($D11=\"CO2e\",AV11,AV11*HLOOKUP($E11,'Reference Tables'!$F$85:$I$105,17,FALSE))))","v":""},{"$f":"IFERROR(IF(AW11=\"\",\"\",AW11*$I11),\"\")","v":""},null,{"$f":"IF(AY11=\"\",\"\",IF($D11=\"\",AY11,IF($D11=\"CO2e\",AY11,AY11*HLOOKUP($E11,'Reference Tables'!$F$85:$I$105,18,FALSE))))","v":""},{"$f":"IFERROR(IF(AZ11=\"\",\"\",AZ11*$I11),\"\")","v":""},null,{"$f":"IF(BB11=\"\",\"\",IF($D11=\"\",BB11,IF($D11=\"CO2e\",BB11,BB11*HLOOKUP($E11,'Reference Tables'!$F$85:$I$105,19,FALSE))))","v":""},{"$f":"IFERROR(IF(BC11=\"\",\"\",BC11*$I11),\"\")","v":""},null,{"$f":"IF(BE11=\"\",\"\",IF($D11=\"\",BE11,IF($D11=\"CO2e\",BE11,BE11*HLOOKUP($E11,'Reference Tables'!$F$85:$I$105,20,FALSE))))","v":""},{"$f":"IFERROR(IF(BF11=\"\",\"\",BF11*$I11),\"\")","v":""},null,{"$f":"IF(BH11=\"\",\"\",IF($D11=\"\",BH11,IF($D11=\"CO2e\",BH11,BH11*HLOOKUP($E11,'Reference Tables'!$F$85:$I$105,6,FALSE))))","v":""},{"$f":"IFERROR(IF(BI11=\"\",\"\",BI11*$I11),\"\")","v":""},null,{"$f":"IF(BK11=\"\",\"\",IF($D11=\"\",BK11,IF($D11=\"CO2e\",BK11,BK11*HLOOKUP($E11,'Reference Tables'!$F$85:$I$105,6,FALSE))))","v":""},{"$f":"IFERROR(IF(BL11=\"\",\"\",BL11*$I11),\"\")","v":""},null,{"$f":"IFERROR(IF(BN11=\"\",\"\",BN11*$I11),\"\")","v":""},null,{"$f":"IFERROR(IF(BP11=\"\",\"\",BP11*$I11),\"\")","v":""},2006,"International","Default IPCC emission factors for gas distribution losses","2006 IPCC Guidelines for National Greenhouse Gas Inventories (Chapter 4; Table 4.2.4 and 4.2.5)"]
[null,"Natural gas emission factor","EF_natural gas Peoples","GHG","2AR","kg","/","therm",{"$f":"IFERROR(IF(F12=\"\",\"\",VLOOKUP(F12,'Reference Tables'!$D$137:$G$142,4,FALSE)),\"\")","v":1E-3},{"$f":"[2]!kgCO2_therm_Peoples","v":5.4920337870651696},5.4920337870651694E-3,{"$f":"[2]!kgCH4_therm_Peoples","v":9.4019096643471901E-3},{"$f":"IF(L12=\"\",\"\",IF($D12=\"\",L12,IF($D12=\"CO2e\",L12,L12*HLOOKUP($E12,'Reference Tables'!$F$85:$I$105,4,FALSE))))","v":0.197440102951291},1.97440102951291E-4,{"$f":"[2]!kgN2O_therm_nationalaverage","v":9.9976124488000006E-6},{"$f":"IF(O12=\"\",\"\",IF($D12=\"\",O12,IF($D12=\"CO2e\",O12,O12*HLOOKUP($E12,'Reference Tables'!$F$85:$I$105,5,FALSE))))","v":3.0992598591280001E-3},3.0992598591280001E-6,null,{"$f":"IF(R12=\"\",\"\",IF($D12=\"\",R12,IF($D12=\"CO2e\",R12,R12*HLOOKUP($E12,'Reference Tables'!$F$85:$I$105,7,FALSE))))","v":""},{"$f":"IFERROR(IF(S12=\"\",\"\",S12*$I12),\"\")","v":""},null,{"$f":"IF(U12=\"\",\"\",IF($D12=\"\",U12,IF($D12=\"CO2e\",U12,U12*HLOOKUP($E12,'Reference Tables'!$F$85:$I$105,8,FALSE))))","v":""},{"$f":"IFERROR(IF(V12=\"\",\"\",V12*$I12),\"\")","v":""},null,{"$f":"IF(X12=\"\",\"\",IF($D12=\"\",X12,IF($D12=\"CO2e\",X12,X12*HLOOKUP($E12,'Reference Tables'!$F$85:$I$105,9,FALSE))))","v":""},{"$f":"IFERROR(IF(Y12=\"\",\"\",Y12*$I12),\"\")","v":""},null,{"$f":"IF(AA12=\"\",\"\",IF($D12=\"\",AA12,IF($D12=\"CO2e\",AA12,AA12*HLOOKUP($E12,'Reference Tables'!$F$85:$I$105,10,FALSE))))","v":""},{"$f":"IFERROR(IF(AB12=\"\",\"\",AB12*$I12),\"\")","v":""},null,{"$f":"IF(AD12=\"\",\"\",IF($D12=\"\",AD12,IF($D12=\"CO2e\",AD12,AD12*HLOOKUP($E12,'Reference Tables'!$F$85:$I$105,11,FALSE))))","v":""},{"$f":"IFERROR(IF(AE12=\"\",\"\",AE12*$I12),\"\")","v":""},null,{"$f":"IF(AG12=\"\",\"\",IF($D12=\"\",AG12,IF($D12=\"CO2e\",AG12,AG12*HLOOKUP($E12,'Reference Tables'!$F$85:$I$105,12,FALSE))))","v":""},{"$f":"IFERROR(IF(AH12=\"\",\"\",AH12*$I12),\"\")","v":""},null,{"$f":"IF(AJ12=\"\",\"\",IF($D12=\"\",AJ12,IF($D12=\"CO2e\",AJ12,AJ12*HLOOKUP($E12,'Reference Tables'!$F$85:$I$105,13,FALSE))))","v":""},{"$f":"IFERROR(IF(AK12=\"\",\"\",AK12*$I12),\"\")","v":""},null,{"$f":"IF(AM12=\"\",\"\",IF($D12=\"\",AM12,IF($D12=\"CO2e\",AM12,AM12*HLOOKUP($E12,'Reference Tables'!$F$85:$I$105,14,FALSE))))","v":""},{"$f":"IFERROR(IF(AN12=\"\",\"\",AN12*$I12),\"\")","v":""},null,{"$f":"IF(AP12=\"\",\"\",IF($D12=\"\",AP12,IF($D12=\"CO2e\",AP12,AP12*HLOOKUP($E12,'Reference Tables'!$F$85:$I$105,15,FALSE))))","v":""},{"$f":"IFERROR(IF(AQ12=\"\",\"\",AQ12*$I12),\"\")","v":""},null,{"$f":"IF(AS12=\"\",\"\",IF($D12=\"\",AS12,IF($D12=\"CO2e\",AS12,AS12*HLOOKUP($E12,'Reference Tables'!$F$85:$I$105,16,FALSE))))","v":""},{"$f":"IFERROR(IF(AT12=\"\",\"\",AT12*$I12),\"\")","v":""},null,{"$f":"IF(AV12=\"\",\"\",IF($D12=\"\",AV12,IF($D12=\"CO2e\",AV12,AV12*HLOOKUP($E12,'Reference Tables'!$F$85:$I$105,17,FALSE))))","v":""},{"$f":"IFERROR(IF(AW12=\"\",\"\",AW12*$I12),\"\")","v":""},null,{"$f":"IF(AY12=\"\",\"\",IF($D12=\"\",AY12,IF($D12=\"CO2e\",AY12,AY12*HLOOKUP($E12,'Reference Tables'!$F$85:$I$105,18,FALSE))))","v":""},{"$f":"IFERROR(IF(AZ12=\"\",\"\",AZ12*$I12),\"\")","v":""},null,{"$f":"IF(BB12=\"\",\"\",IF($D12=\"\",BB12,IF($D12=\"CO2e\",BB12,BB12*HLOOKUP($E12,'Reference Tables'!$F$85:$I$105,19,FALSE))))","v":""},{"$f":"IFERROR(IF(BC12=\"\",\"\",BC12*$I12),\"\")","v":""},null,{"$f":"IF(BE12=\"\",\"\",IF($D12=\"\",BE12,IF($D12=\"CO2e\",BE12,BE12*HLOOKUP($E12,'Reference Tables'!$F$85:$I$105,20,FALSE))))","v":""},{"$f":"IFERROR(IF(BF12=\"\",\"\",BF12*$I12),\"\")","v":""},null,{"$f":"IF(BH12=\"\",\"\",IF($D12=\"\",BH12,IF($D12=\"CO2e\",BH12,BH12*HLOOKUP($E12,'Reference Tables'!$F$85:$I$105,6,FALSE))))","v":""},{"$f":"IFERROR(IF(BI12=\"\",\"\",BI12*$I12),\"\")","v":""},null,{"$f":"IF(BK12=\"\",\"\",IF($D12=\"\",BK12,IF($D12=\"CO2e\",BK12,BK12*HLOOKUP($E12,'Reference Tables'!$F$85:$I$105,6,FALSE))))","v":""},"",null,"",null,"",2010,"Local","Emission factor developed by ICF using Peoples Gas use data"]
[null,"Electricity emission factor","EF_electricity","GHG","2AR","lb","/","MWh",{"$f":"IFERROR(IF(F13=\"\",\"\",VLOOKUP(F13,'Reference Tables'!$D$137:$G$142,4,FALSE)),\"\")","v":4.5359237038037839E-4},{"$f":"[2]!ICF_2010_lbsCO2_MWh","v":1352.18802108982},0.61334216968608457,{"$f":"[2]!ICF_2010_lbsCH4_MWh","v":2.09619253426876E-2},{"$f":"IF(L13=\"\",\"\",IF($D13=\"\",L13,IF($D13=\"CO2e\",L13,L13*HLOOKUP($E13,'Reference Tables'!$F$85:$I$105,4,FALSE))))","v":0.44020043219643962},1.9967155748245008E-4,{"$f":"[2]!ICF_2010_lbsN2O_MWh","v":2.2437290609817299E-2},{"$f":"IF(O13=\"\",\"\",IF($D13=\"\",O13,IF($D13=\"CO2e\",O13,O13*HLOOKUP($E13,'Reference Tables'!$F$85:$I$105,5,FALSE))))","v":6.9555600890433631},3.1549889881123346E-3,null,{"$f":"IF(R13=\"\",\"\",IF($D13=\"\",R13,IF($D13=\"CO2e\",R13,R13*HLOOKUP($E13,'Reference Tables'!$F$85:$I$105,7,FALSE))))","v":""},"",null,{"$f":"IF(U13=\"\",\"\",IF($D13=\"\",U13,IF($D13=\"CO2e\",U13,U13*HLOOKUP($E13,'Reference Tables'!$F$85:$I$105,8,FALSE))))","v":""},"",null,{"$f":"IF(X13=\"\",\"\",IF($D13=\"\",X13,IF($D13=\"CO2e\",X13,X13*HLOOKUP($E13,'Reference Tables'!$F$85:$I$105,9,FALSE))))","v":""},"",null,{"$f":"IF(AA13=\"\",\"\",IF($D13=\"\",AA13,IF($D13=\"CO2e\",AA13,AA13*HLOOKUP($E13,'Reference Tables'!$F$85:$I$105,10,FALSE))))","v":""},"",null,{"$f":"IF(AD13=\"\",\"\",IF($D13=\"\",AD13,IF($D13=\"CO2e\",AD13,AD13*HLOOKUP($E13,'Reference Tables'!$F$85:$I$105,11,FALSE))))","v":""},"",null,{"$f":"IF(AG13=\"\",\"\",IF($D13=\"\",AG13,IF($D13=\"CO2e\",AG13,AG13*HLOOKUP($E13,'Reference Tables'!$F$85:$I$105,12,FALSE))))","v":""},"",null,{"$f":"IF(AJ13=\"\",\"\",IF($D13=\"\",AJ13,IF($D13=\"CO2e\",AJ13,AJ13*HLOOKUP($E13,'Reference Tables'!$F$85:$I$105,13,FALSE))))","v":""},"",null,{"$f":"IF(AM13=\"\",\"\",IF($D13=\"\",AM13,IF($D13=\"CO2e\",AM13,AM13*HLOOKUP($E13,'Reference Tables'!$F$85:$I$105,14,FALSE))))","v":""},"",null,{"$f":"IF(AP13=\"\",\"\",IF($D13=\"\",AP13,IF($D13=\"CO2e\",AP13,AP13*HLOOKUP($E13,'Reference Tables'!$F$85:$I$105,15,FALSE))))","v":""},"",null,{"$f":"IF(AS13=\"\",\"\",IF($D13=\"\",AS13,IF($D13=\"CO2e\",AS13,AS13*HLOOKUP($E13,'Reference Tables'!$F$85:$I$105,16,FALSE))))","v":""},"",null,{"$f":"IF(AV13=\"\",\"\",IF($D13=\"\",AV13,IF($D13=\"CO2e\",AV13,AV13*HLOOKUP($E13,'Reference Tables'!$F$85:$I$105,17,FALSE))))","v":""},"",null,{"$f":"IF(AY13=\"\",\"\",IF($D13=\"\",AY13,IF($D13=\"CO2e\",AY13,AY13*HLOOKUP($E13,'Reference Tables'!$F$85:$I$105,18,FALSE))))","v":""},"",null,{"$f":"IF(BB13=\"\",\"\",IF($D13=\"\",BB13,IF($D13=\"CO2e\",BB13,BB13*HLOOKUP($E13,'Reference Tables'!$F$85:$I$105,19,FALSE))))","v":""},"",null,{"$f":"IF(BE13=\"\",\"\",IF($D13=\"\",BE13,IF($D13=\"CO2e\",BE13,BE13*HLOOKUP($E13,'Reference Tables'!$F$85:$I$105,20,FALSE))))","v":""},"",null,{"$f":"IF(BH13=\"\",\"\",IF($D13=\"\",BH13,IF($D13=\"CO2e\",BH13,BH13*HLOOKUP($E13,'Reference Tables'!$F$85:$I$105,6,FALSE))))","v":""},"",null,{"$f":"IF(BK13=\"\",\"\",IF($D13=\"\",BK13,IF($D13=\"CO2e\",BK13,BK13*HLOOKUP($E13,'Reference Tables'!$F$85:$I$105,6,FALSE))))","v":""},"",null,"",null,"",2010,"Regional","eGRID 2010 Update RFC region"]
[null,"Motorcycle emission factor","EF_motorcycle","CO2e","2AR","g","/","mile",{"$f":"IFERROR(IF(F14=\"\",\"\",VLOOKUP(F14,'Reference Tables'!$D$137:$G$142,4,FALSE)),\"\")","v":9.9999999999999995E-7},null,"",null,{"$f":"IF(L14=\"\",\"\",IF($D14=\"\",L14,IF($D14=\"CO2e\",L14,L14*HLOOKUP($E14,'Reference Tables'!$F$85:$I$105,4,FALSE))))","v":""},"",null,{"$f":"IF(O14=\"\",\"\",IF($D14=\"\",O14,IF($D14=\"CO2e\",O14,O14*HLOOKUP($E14,'Reference Tables'!$F$85:$I$105,5,FALSE))))","v":""},"",null,{"$f":"IF(R14=\"\",\"\",IF($D14=\"\",R14,IF($D14=\"CO2e\",R14,R14*HLOOKUP($E14,'Reference Tables'!$F$85:$I$105,7,FALSE))))","v":""},"",null,{"$f":"IF(U14=\"\",\"\",IF($D14=\"\",U14,IF($D14=\"CO2e\",U14,U14*HLOOKUP($E14,'Reference Tables'!$F$85:$I$105,8,FALSE))))","v":""},"",null,{"$f":"IF(X14=\"\",\"\",IF($D14=\"\",X14,IF($D14=\"CO2e\",X14,X14*HLOOKUP($E14,'Reference Tables'!$F$85:$I$105,9,FALSE))))","v":""},"",null,{"$f":"IF(AA14=\"\",\"\",IF($D14=\"\",AA14,IF($D14=\"CO2e\",AA14,AA14*HLOOKUP($E14,'Reference Tables'!$F$85:$I$105,10,FALSE))))","v":""},"",null,{"$f":"IF(AD14=\"\",\"\",IF($D14=\"\",AD14,IF($D14=\"CO2e\",AD14,AD14*HLOOKUP($E14,'Reference Tables'!$F$85:$I$105,11,FALSE))))","v":""},"",null,{"$f":"IF(AG14=\"\",\"\",IF($D14=\"\",AG14,IF($D14=\"CO2e\",AG14,AG14*HLOOKUP($E14,'Reference Tables'!$F$85:$I$105,12,FALSE))))","v":""},"",null,{"$f":"IF(AJ14=\"\",\"\",IF($D14=\"\",AJ14,IF($D14=\"CO2e\",AJ14,AJ14*HLOOKUP($E14,'Reference Tables'!$F$85:$I$105,13,FALSE))))","v":""},"",null,{"$f":"IF(AM14=\"\",\"\",IF($D14=\"\",AM14,IF($D14=\"CO2e\",AM14,AM14*HLOOKUP($E14,'Reference Tables'!$F$85:$I$105,14,FALSE))))","v":""},"",null,{"$f":"IF(AP14=\"\",\"\",IF($D14=\"\",AP14,IF($D14=\"CO2e\",AP14,AP14*HLOOKUP($E14,'Reference Tables'!$F$85:$I$105,15,FALSE))))","v":""},"",null,{"$f":"IF(AS14=\"\",\"\",IF($D14=\"\",AS14,IF($D14=\"CO2e\",AS14,AS14*HLOOKUP($E14,'Reference Tables'!$F$85:$I$105,16,FALSE))))","v":""},"",null,{"$f":"IF(AV14=\"\",\"\",IF($D14=\"\",AV14,IF($D14=\"CO2e\",AV14,AV14*HLOOKUP($E14,'Reference Tables'!$F$85:$I$105,17,FALSE))))","v":""},"",null,{"$f":"IF(AY14=\"\",\"\",IF($D14=\"\",AY14,IF($D14=\"CO2e\",AY14,AY14*HLOOKUP($E14,'Reference Tables'!$F$85:$I$105,18,FALSE))))","v":""},"",null,{"$f":"IF(BB14=\"\",\"\",IF($D14=\"\",BB14,IF($D14=\"CO2e\",BB14,BB14*HLOOKUP($E14,'Reference Tables'!$F$85:$I$105,19,FALSE))))","v":""},"",null,{"$f":"IF(BE14=\"\",\"\",IF($D14=\"\",BE14,IF($D14=\"CO2e\",BE14,BE14*HLOOKUP($E14,'Reference Tables'!$F$85:$I$105,20,FALSE))))","v":""},"",null,{"$f":"IF(BH14=\"\",\"\",IF($D14=\"\",BH14,IF($D14=\"CO2e\",BH14,BH14*HLOOKUP($E14,'Reference Tables'!$F$85:$I$105,6,FALSE))))","v":""},"",null,{"$f":"IF(BK14=\"\",\"\",IF($D14=\"\",BK14,IF($D14=\"CO2e\",BK14,BK14*HLOOKUP($E14,'Reference Tables'!$F$85:$I$105,6,FALSE))))","v":""},"",{"$f":"'[3]EF calculations'!$J$10","v":376.46988517695394},3.7646988517695391E-4,null,""]
[null,"Passenger car emission factor - gasoline","EF_passenger car - gasoline","CO2e","2AR","g",{"$f":"IF(F15=\"\",\"\",\"/\")","v":"/"},"mile",{"$f":"IFERROR(IF(F15=\"\",\"\",VLOOKUP(F15,'Reference Tables'!$D$137:$G$142,4,FALSE)),\"\")","v":9.9999999999999995E-7},null,"",null,{"$f":"IF(L15=\"\",\"\",IF($D15=\"\",L15,IF($D15=\"CO2e\",L15,L15*HLOOKUP($E15,'Reference Tables'!$F$85:$I$105,4,FALSE))))","v":""},"",null,{"$f":"IF(O15=\"\",\"\",IF($D15=\"\",O15,IF($D15=\"CO2e\",O15,O15*HLOOKUP($E15,'Reference Tables'!$F$85:$I$105,5,FALSE))))","v":""},"",null,{"$f":"IF(R15=\"\",\"\",IF($D15=\"\",R15,IF($D15=\"CO2e\",R15,R15*HLOOKUP($E15,'Reference Tables'!$F$85:$I$105,7,FALSE))))","v":""},"",null,{"$f":"IF(U15=\"\",\"\",IF($D15=\"\",U15,IF($D15=\"CO2e\",U15,U15*HLOOKUP($E15,'Reference Tables'!$F$85:$I$105,8,FALSE))))","v":""},"",null,{"$f":"IF(X15=\"\",\"\",IF($D15=\"\",X15,IF($D15=\"CO2e\",X15,X15*HLOOKUP($E15,'Reference Tables'!$F$85:$I$105,9,FALSE))))","v":""},"",null,{"$f":"IF(AA15=\"\",\"\",IF($D15=\"\",AA15,IF($D15=\"CO2e\",AA15,AA15*HLOOKUP($E15,'Reference Tables'!$F$85:$I$105,10,FALSE))))","v":""},"",null,{"$f":"IF(AD15=\"\",\"\",IF($D15=\"\",AD15,IF($D15=\"CO2e\",AD15,AD15*HLOOKUP($E15,'Reference Tables'!$F$85:$I$105,11,FALSE))))","v":""},"",null,{"$f":"IF(AG15=\"\",\"\",IF($D15=\"\",AG15,IF($D15=\"CO2e\",AG15,AG15*HLOOKUP($E15,'Reference Tables'!$F$85:$I$105,12,FALSE))))","v":""},"",null,{"$f":"IF(AJ15=\"\",\"\",IF($D15=\"\",AJ15,IF($D15=\"CO2e\",AJ15,AJ15*HLOOKUP($E15,'Reference Tables'!$F$85:$I$105,13,FALSE))))","v":""},"",null,{"$f":"IF(AM15=\"\",\"\",IF($D15=\"\",AM15,IF($D15=\"CO2e\",AM15,AM15*HLOOKUP($E15,'Reference Tables'!$F$85:$I$105,14,FALSE))))","v":""},"",null,{"$f":"IF(AP15=\"\",\"\",IF($D15=\"\",AP15,IF($D15=\"CO2e\",AP15,AP15*HLOOKUP($E15,'Reference Tables'!$F$85:$I$105,15,FALSE))))","v":""},"",null,{"$f":"IF(AS15=\"\",\"\",IF($D15=\"\",AS15,IF($D15=\"CO2e\",AS15,AS15*HLOOKUP($E15,'Reference Tables'!$F$85:$I$105,16,FALSE))))","v":""},"",null,{"$f":"IF(AV15=\"\",\"\",IF($D15=\"\",AV15,IF($D15=\"CO2e\",AV15,AV15*HLOOKUP($E15,'Reference Tables'!$F$85:$I$105,17,FALSE))))","v":""},"",null,{"$f":"IF(AY15=\"\",\"\",IF($D15=\"\",AY15,IF($D15=\"CO2e\",AY15,AY15*HLOOKUP($E15,'Reference Tables'!$F$85:$I$105,18,FALSE))))","v":""},"",null,{"$f":"IF(BB15=\"\",\"\",IF($D15=\"\",BB15,IF($D15=\"CO2e\",BB15,BB15*HLOOKUP($E15,'Reference Tables'!$F$85:$I$105,19,FALSE))))","v":""},"",null,{"$f":"IF(BE15=\"\",\"\",IF($D15=\"\",BE15,IF($D15=\"CO2e\",BE15,BE15*HLOOKUP($E15,'Reference Tables'!$F$85:$I$105,20,FALSE))))","v":""},"",null,{"$f":"IF(BH15=\"\",\"\",IF($D15=\"\",BH15,IF($D15=\"CO2e\",BH15,BH15*HLOOKUP($E15,'Reference Tables'!$F$85:$I$105,6,FALSE))))","v":""},"",null,{"$f":"IF(BK15=\"\",\"\",IF($D15=\"\",BK15,IF($D15=\"CO2e\",BK15,BK15*HLOOKUP($E15,'Reference Tables'!$F$85:$I$105,6,FALSE))))","v":""},"",{"$f":"'[3]EF calculations'!$J$11","v":380.26687123177783},3.8026687123177778E-4,null,""]
[null,"Passenger car emission factor - diesel","EF_passenger car - diesel","CO2e","2AR","g","/","mile",{"$f":"IFERROR(IF(F16=\"\",\"\",VLOOKUP(F16,'Reference Tables'!$D$137:$G$142,4,FALSE)),\"\")","v":9.9999999999999995E-7},null,"",null,{"$f":"IF(L16=\"\",\"\",IF($D16=\"\",L16,IF($D16=\"CO2e\",L16,L16*HLOOKUP($E16,'Reference Tables'!$F$85:$I$105,4,FALSE))))","v":""},"",null,{"$f":"IF(O16=\"\",\"\",IF($D16=\"\",O16,IF($D16=\"CO2e\",O16,O16*HLOOKUP($E16,'Reference Tables'!$F$85:$I$105,5,FALSE))))","v":""},"",null,{"$f":"IF(R16=\"\",\"\",IF($D18=\"\",R16,IF($D18=\"CO2e\",R16,R16*HLOOKUP($E16,'Reference Tables'!$F$85:$I$105,7,FALSE))))","v":""},"",null,{"$f":"IF(U16=\"\",\"\",IF($D18=\"\",U16,IF($D18=\"CO2e\",U16,U16*HLOOKUP($E16,'Reference Tables'!$F$85:$I$105,8,FALSE))))","v":""},"",null,{"$f":"IF(X16=\"\",\"\",IF($D18=\"\",X16,IF($D18=\"CO2e\",X16,X16*HLOOKUP($E16,'Reference Tables'!$F$85:$I$105,9,FALSE))))","v":""},"",null,{"$f":"IF(AA16=\"\",\"\",IF($D18=\"\",AA16,IF($D18=\"CO2e\",AA16,AA16*HLOOKUP($E16,'Reference Tables'!$F$85:$I$105,10,FALSE))))","v":""},"",null,{"$f":"IF(AD16=\"\",\"\",IF($D18=\"\",AD16,IF($D18=\"CO2e\",AD16,AD16*HLOOKUP($E16,'Reference Tables'!$F$85:$I$105,11,FALSE))))","v":""},"",null,{"$f":"IF(AG16=\"\",\"\",IF($D18=\"\",AG16,IF($D18=\"CO2e\",AG16,AG16*HLOOKUP($E16,'Reference Tables'!$F$85:$I$105,12,FALSE))))","v":""},"",null,{"$f":"IF(AJ16=\"\",\"\",IF($D18=\"\",AJ16,IF($D18=\"CO2e\",AJ16,AJ16*HLOOKUP($E16,'Reference Tables'!$F$85:$I$105,13,FALSE))))","v":""},"",null,{"$f":"IF(AM16=\"\",\"\",IF($D18=\"\",AM16,IF($D18=\"CO2e\",AM16,AM16*HLOOKUP($E16,'Reference Tables'!$F$85:$I$105,14,FALSE))))","v":""},"",null,{"$f":"IF(AP16=\"\",\"\",IF($D18=\"\",AP16,IF($D18=\"CO2e\",AP16,AP16*HLOOKUP($E16,'Reference Tables'!$F$85:$I$105,15,FALSE))))","v":""},"",null,{"$f":"IF(AS16=\"\",\"\",IF($D18=\"\",AS16,IF($D18=\"CO2e\",AS16,AS16*HLOOKUP($E16,'Reference Tables'!$F$85:$I$105,16,FALSE))))","v":""},"",null,{"$f":"IF(AV16=\"\",\"\",IF($D18=\"\",AV16,IF($D18=\"CO2e\",AV16,AV16*HLOOKUP($E16,'Reference Tables'!$F$85:$I$105,17,FALSE))))","v":""},"",null,{"$f":"IF(AY16=\"\",\"\",IF($D18=\"\",AY16,IF($D18=\"CO2e\",AY16,AY16*HLOOKUP($E16,'Reference Tables'!$F$85:$I$105,18,FALSE))))","v":""},"",null,{"$f":"IF(BB16=\"\",\"\",IF($D18=\"\",BB16,IF($D18=\"CO2e\",BB16,BB16*HLOOKUP($E16,'Reference Tables'!$F$85:$I$105,19,FALSE))))","v":""},"",null,{"$f":"IF(BE16=\"\",\"\",IF($D18=\"\",BE16,IF($D18=\"CO2e\",BE16,BE16*HLOOKUP($E16,'Reference Tables'!$F$85:$I$105,20,FALSE))))","v":""},"",null,{"$f":"IF(BH16=\"\",\"\",IF($D18=\"\",BH16,IF($D18=\"CO2e\",BH16,BH16*HLOOKUP($E16,'Reference Tables'!$F$85:$I$105,6,FALSE))))","v":""},"",null,{"$f":"IF(BK16=\"\",\"\",IF($D18=\"\",BK16,IF($D18=\"CO2e\",BK16,BK16*HLOOKUP($E16,'Reference Tables'!$F$85:$I$105,6,FALSE))))","v":""},"",{"$f":"'[3]EF calculations'!$N$11","v":422.92126791029},4.2292126791028997E-4,null,""]
[null,"Passenger truck emission factor - gasoline","EF_passenger truck - gasoline","CO2e","2AR","g","/","mile",{"$f":"IFERROR(IF(F17=\"\",\"\",VLOOKUP(F17,'Reference Tables'!$D$137:$G$142,4,FALSE)),\"\")","v":9.9999999999999995E-7},null,"",null,{"$f":"IF(L17=\"\",\"\",IF($D17=\"\",L17,IF($D17=\"CO2e\",L17,L17*HLOOKUP($E17,'Reference Tables'!$F$85:$I$105,4,FALSE))))","v":""},"",null,{"$f":"IF(O17=\"\",\"\",IF($D17=\"\",O17,IF($D17=\"CO2e\",O17,O17*HLOOKUP($E17,'Reference Tables'!$F$85:$I$105,5,FALSE))))","v":""},"",null,{"$f":"IF(R17=\"\",\"\",IF($D21=\"\",R17,IF($D21=\"CO2e\",R17,R17*HLOOKUP($E17,'Reference Tables'!$F$85:$I$105,7,FALSE))))","v":""},"",null,{"$f":"IF(U17=\"\",\"\",IF($D21=\"\",U17,IF($D21=\"CO2e\",U17,U17*HLOOKUP($E17,'Reference Tables'!$F$85:$I$105,8,FALSE))))","v":""},"",null,{"$f":"IF(X17=\"\",\"\",IF($D21=\"\",X17,IF($D21=\"CO2e\",X17,X17*HLOOKUP($E17,'Reference Tables'!$F$85:$I$105,9,FALSE))))","v":""},"",null,{"$f":"IF(AA17=\"\",\"\",IF($D21=\"\",AA17,IF($D21=\"CO2e\",AA17,AA17*HLOOKUP($E17,'Reference Tables'!$F$85:$I$105,10,FALSE))))","v":""},"",null,{"$f":"IF(AD17=\"\",\"\",IF($D21=\"\",AD17,IF($D21=\"CO2e\",AD17,AD17*HLOOKUP($E17,'Reference Tables'!$F$85:$I$105,11,FALSE))))","v":""},"",null,{"$f":"IF(AG17=\"\",\"\",IF($D21=\"\",AG17,IF($D21=\"CO2e\",AG17,AG17*HLOOKUP($E17,'Reference Tables'!$F$85:$I$105,12,FALSE))))","v":""},"",null,{"$f":"IF(AJ17=\"\",\"\",IF($D21=\"\",AJ17,IF($D21=\"CO2e\",AJ17,AJ17*HLOOKUP($E17,'Reference Tables'!$F$85:$I$105,13,FALSE))))","v":""},"",null,{"$f":"IF(AM17=\"\",\"\",IF($D21=\"\",AM17,IF($D21=\"CO2e\",AM17,AM17*HLOOKUP($E17,'Reference Tables'!$F$85:$I$105,14,FALSE))))","v":""},"",null,{"$f":"IF(AP17=\"\",\"\",IF($D21=\"\",AP17,IF($D21=\"CO2e\",AP17,AP17*HLOOKUP($E17,'Reference Tables'!$F$85:$I$105,15,FALSE))))","v":""},"",null,{"$f":"IF(AS17=\"\",\"\",IF($D21=\"\",AS17,IF($D21=\"CO2e\",AS17,AS17*HLOOKUP($E17,'Reference Tables'!$F$85:$I$105,16,FALSE))))","v":""},"",null,{"$f":"IF(AV17=\"\",\"\",IF($D21=\"\",AV17,IF($D21=\"CO2e\",AV17,AV17*HLOOKUP($E17,'Reference Tables'!$F$85:$I$105,17,FALSE))))","v":""},"",null,{"$f":"IF(AY17=\"\",\"\",IF($D21=\"\",AY17,IF($D21=\"CO2e\",AY17,AY17*HLOOKUP($E17,'Reference Tables'!$F$85:$I$105,18,FALSE))))","v":""},"",null,{"$f":"IF(BB17=\"\",\"\",IF($D21=\"\",BB17,IF($D21=\"CO2e\",BB17,BB17*HLOOKUP($E17,'Reference Tables'!$F$85:$I$105,19,FALSE))))","v":""},"",null,{"$f":"IF(BE17=\"\",\"\",IF($D21=\"\",BE17,IF($D21=\"CO2e\",BE17,BE17*HLOOKUP($E17,'Reference Tables'!$F$85:$I$105,20,FALSE))))","v":""},"",null,{"$f":"IF(BH17=\"\",\"\",IF($D21=\"\",BH17,IF($D21=\"CO2e\",BH17,BH17*HLOOKUP($E17,'Reference Tables'!$F$85:$I$105,6,FALSE))))","v":""},"",null,{"$f":"IF(BK17=\"\",\"\",IF($D21=\"\",BK17,IF($D21=\"CO2e\",BK17,BK17*HLOOKUP($E17,'Reference Tables'!$F$85:$I$105,6,FALSE))))","v":""},"",{"$f":"'[3]EF calculations'!$J$12","v":527.84500669770557},5.2784500669770553E-4,null,""]
[null,"Passenger truck emission factor - diesel","EF_passenger truck - diesel","CO2e","2AR","g","/","mile",{"$f":"IFERROR(IF(F18=\"\",\"\",VLOOKUP(F18,'Reference Tables'!$D$137:$G$142,4,FALSE)),\"\")","v":9.9999999999999995E-7},null,"",null,{"$f":"IF(L18=\"\",\"\",IF($D18=\"\",L18,IF($D18=\"CO2e\",L18,L18*HLOOKUP($E18,'Reference Tables'!$F$85:$I$105,4,FALSE))))","v":""},"",null,{"$f":"IF(O18=\"\",\"\",IF($D18=\"\",O18,IF($D18=\"CO2e\",O18,O18*HLOOKUP($E18,'Reference Tables'!$F$85:$I$105,5,FALSE))))","v":""},"",null,{"$f":"IF(R18=\"\",\"\",IF(#REF!=\"\",R18,IF(#REF!=\"CO2e\",R18,R18*HLOOKUP($E18,'Reference Tables'!$F$85:$I$105,7,FALSE))))","v":""},{"$f":"IFERROR(IF(S18=\"\",\"\",S18*$I18),\"\")","v":""},null,{"$f":"IF(U18=\"\",\"\",IF(#REF!=\"\",U18,IF(#REF!=\"CO2e\",U18,U18*HLOOKUP($E18,'Reference Tables'!$F$85:$I$105,8,FALSE))))","v":""},{"$f":"IFERROR(IF(V18=\"\",\"\",V18*$I18),\"\")","v":""},null,{"$f":"IF(X18=\"\",\"\",IF(#REF!=\"\",X18,IF(#REF!=\"CO2e\",X18,X18*HLOOKUP($E18,'Reference Tables'!$F$85:$I$105,9,FALSE))))","v":""},{"$f":"IFERROR(IF(Y18=\"\",\"\",Y18*$I18),\"\")","v":""},null,{"$f":"IF(AA18=\"\",\"\",IF(#REF!=\"\",AA18,IF(#REF!=\"CO2e\",AA18,AA18*HLOOKUP($E18,'Reference Tables'!$F$85:$I$105,10,FALSE))))","v":""},{"$f":"IFERROR(IF(AB18=\"\",\"\",AB18*$I18),\"\")","v":""},null,{"$f":"IF(AD18=\"\",\"\",IF(#REF!=\"\",AD18,IF(#REF!=\"CO2e\",AD18,AD18*HLOOKUP($E18,'Reference Tables'!$F$85:$I$105,11,FALSE))))","v":""},{"$f":"IFERROR(IF(AE18=\"\",\"\",AE18*$I18),\"\")","v":""},null,{"$f":"IF(AG18=\"\",\"\",IF(#REF!=\"\",AG18,IF(#REF!=\"CO2e\",AG18,AG18*HLOOKUP($E18,'Reference Tables'!$F$85:$I$105,12,FALSE))))","v":""},{"$f":"IFERROR(IF(AH18=\"\",\"\",AH18*$I18),\"\")","v":""},null,{"$f":"IF(AJ18=\"\",\"\",IF(#REF!=\"\",AJ18,IF(#REF!=\"CO2e\",AJ18,AJ18*HLOOKUP($E18,'Reference Tables'!$F$85:$I$105,13,FALSE))))","v":""},{"$f":"IFERROR(IF(AK18=\"\",\"\",AK18*$I18),\"\")","v":""},null,{"$f":"IF(AM18=\"\",\"\",IF(#REF!=\"\",AM18,IF(#REF!=\"CO2e\",AM18,AM18*HLOOKUP($E18,'Reference Tables'!$F$85:$I$105,14,FALSE))))","v":""},{"$f":"IFERROR(IF(AN18=\"\",\"\",AN18*$I18),\"\")","v":""},null,{"$f":"IF(AP18=\"\",\"\",IF(#REF!=\"\",AP18,IF(#REF!=\"CO2e\",AP18,AP18*HLOOKUP($E18,'Reference Tables'!$F$85:$I$105,15,FALSE))))","v":""},{"$f":"IFERROR(IF(AQ18=\"\",\"\",AQ18*$I18),\"\")","v":""},null,{"$f":"IF(AS18=\"\",\"\",IF(#REF!=\"\",AS18,IF(#REF!=\"CO2e\",AS18,AS18*HLOOKUP($E18,'Reference Tables'!$F$85:$I$105,16,FALSE))))","v":""},{"$f":"IFERROR(IF(AT18=\"\",\"\",AT18*$I18),\"\")","v":""},null,{"$f":"IF(AV18=\"\",\"\",IF(#REF!=\"\",AV18,IF(#REF!=\"CO2e\",AV18,AV18*HLOOKUP($E18,'Reference Tables'!$F$85:$I$105,17,FALSE))))","v":""},{"$f":"IFERROR(IF(AW18=\"\",\"\",AW18*$I18),\"\")","v":""},null,{"$f":"IF(AY18=\"\",\"\",IF(#REF!=\"\",AY18,IF(#REF!=\"CO2e\",AY18,AY18*HLOOKUP($E18,'Reference Tables'!$F$85:$I$105,18,FALSE))))","v":""},{"$f":"IFERROR(IF(AZ18=\"\",\"\",AZ18*$I18),\"\")","v":""},null,{"$f":"IF(BB18=\"\",\"\",IF(#REF!=\"\",BB18,IF(#REF!=\"CO2e\",BB18,BB18*HLOOKUP($E18,'Reference Tables'!$F$85:$I$105,19,FALSE))))","v":""},{"$f":"IFERROR(IF(BC18=\"\",\"\",BC18*$I18),\"\")","v":""},null,{"$f":"IF(BE18=\"\",\"\",IF(#REF!=\"\",BE18,IF(#REF!=\"CO2e\",BE18,BE18*HLOOKUP($E18,'Reference Tables'!$F$85:$I$105,20,FALSE))))","v":""},{"$f":"IFERROR(IF(BF18=\"\",\"\",BF18*$I18),\"\")","v":""},null,{"$f":"IF(BH18=\"\",\"\",IF(#REF!=\"\",BH18,IF(#REF!=\"CO2e\",BH18,BH18*HLOOKUP($E18,'Reference Tables'!$F$85:$I$105,6,FALSE))))","v":""},{"$f":"IFERROR(IF(BI18=\"\",\"\",BI18*$I18),\"\")","v":""},null,{"$f":"IF(BK18=\"\",\"\",IF(#REF!=\"\",BK18,IF(#REF!=\"CO2e\",BK18,BK18*HLOOKUP($E18,'Reference Tables'!$F$85:$I$105,6,FALSE))))","v":""},{"$f":"IFERROR(IF(BL18=\"\",\"\",BL18*$I18),\"\")","v":""},{"$f":"'[3]EF calculations'!$N$12","v":721.98718604702265},7.2198718604702262E-4,null,""]
[null,"Light commercial truck emission factor - gasoline","EF_light commercial truck - gasoline","CO2e","2AR","g","/","mile",{"$f":"IFERROR(IF(F19=\"\",\"\",VLOOKUP(F19,'Reference Tables'!$D$137:$G$142,4,FALSE)),\"\")","v":9.9999999999999995E-7},null,"",null,{"$f":"IF(L19=\"\",\"\",IF($D19=\"\",L19,IF($D19=\"CO2e\",L19,L19*HLOOKUP($E19,'Reference Tables'!$F$85:$I$105,4,FALSE))))","v":""},"",null,{"$f":"IF(O19=\"\",\"\",IF($D19=\"\",O19,IF($D19=\"CO2e\",O19,O19*HLOOKUP($E19,'Reference Tables'!$F$85:$I$105,5,FALSE))))","v":""},"",null,{"$f":"IF(R19=\"\",\"\",IF(#REF!=\"\",R19,IF(#REF!=\"CO2e\",R19,R19*HLOOKUP($E19,'Reference Tables'!$F$85:$I$105,7,FALSE))))","v":""},"",null,{"$f":"IF(U19=\"\",\"\",IF(#REF!=\"\",U19,IF(#REF!=\"CO2e\",U19,U19*HLOOKUP($E19,'Reference Tables'!$F$85:$I$105,8,FALSE))))","v":""},"",null,{"$f":"IF(X19=\"\",\"\",IF(#REF!=\"\",X19,IF(#REF!=\"CO2e\",X19,X19*HLOOKUP($E19,'Reference Tables'!$F$85:$I$105,9,FALSE))))","v":""},"",null,{"$f":"IF(AA19=\"\",\"\",IF(#REF!=\"\",AA19,IF(#REF!=\"CO2e\",AA19,AA19*HLOOKUP($E19,'Reference Tables'!$F$85:$I$105,10,FALSE))))","v":""},"",null,{"$f":"IF(AD19=\"\",\"\",IF(#REF!=\"\",AD19,IF(#REF!=\"CO2e\",AD19,AD19*HLOOKUP($E19,'Reference Tables'!$F$85:$I$105,11,FALSE))))","v":""},"",null,{"$f":"IF(AG19=\"\",\"\",IF(#REF!=\"\",AG19,IF(#REF!=\"CO2e\",AG19,AG19*HLOOKUP($E19,'Reference Tables'!$F$85:$I$105,12,FALSE))))","v":""},"",null,{"$f":"IF(AJ19=\"\",\"\",IF(#REF!=\"\",AJ19,IF(#REF!=\"CO2e\",AJ19,AJ19*HLOOKUP($E19,'Reference Tables'!$F$85:$I$105,13,FALSE))))","v":""},"",null,{"$f":"IF(AM19=\"\",\"\",IF(#REF!=\"\",AM19,IF(#REF!=\"CO2e\",AM19,AM19*HLOOKUP($E19,'Reference Tables'!$F$85:$I$105,14,FALSE))))","v":""},"",null,{"$f":"IF(AP19=\"\",\"\",IF(#REF!=\"\",AP19,IF(#REF!=\"CO2e\",AP19,AP19*HLOOKUP($E19,'Reference Tables'!$F$85:$I$105,15,FALSE))))","v":""},"",null,{"$f":"IF(AS19=\"\",\"\",IF(#REF!=\"\",AS19,IF(#REF!=\"CO2e\",AS19,AS19*HLOOKUP($E19,'Reference Tables'!$F$85:$I$105,16,FALSE))))","v":""},"",null,{"$f":"IF(AV19=\"\",\"\",IF(#REF!=\"\",AV19,IF(#REF!=\"CO2e\",AV19,AV19*HLOOKUP($E19,'Reference Tables'!$F$85:$I$105,17,FALSE))))","v":""},"",null,{"$f":"IF(AY19=\"\",\"\",IF(#REF!=\"\",AY19,IF(#REF!=\"CO2e\",AY19,AY19*HLOOKUP($E19,'Reference Tables'!$F$85:$I$105,18,FALSE))))","v":""},"",null,{"$f":"IF(BB19=\"\",\"\",IF(#REF!=\"\",BB19,IF(#REF!=\"CO2e\",BB19,BB19*HLOOKUP($E19,'Reference Tables'!$F$85:$I$105,19,FALSE))))","v":""},"",null,{"$f":"IF(BE19=\"\",\"\",IF(#REF!=\"\",BE19,IF(#REF!=\"CO2e\",BE19,BE19*HLOOKUP($E19,'Reference Tables'!$F$85:$I$105,20,FALSE))))","v":""},"",null,{"$f":"IF(BH19=\"\",\"\",IF(#REF!=\"\",BH19,IF(#REF!=\"CO2e\",BH19,BH19*HLOOKUP($E19,'Reference Tables'!$F$85:$I$105,6,FALSE))))","v":""},"",null,{"$f":"IF(BK19=\"\",\"\",IF(#REF!=\"\",BK19,IF(#REF!=\"CO2e\",BK19,BK19*HLOOKUP($E19,'Reference Tables'!$F$85:$I$105,6,FALSE))))","v":""},"",{"$f":"'[3]EF calculations'!$J$13","v":521.01804988662127},5.2101804988662125E-4,null,""]
[null,"Light commercial truck emission factor - diesel","EF_light commercial truck - diesel","CO2e","2AR","g","/","mile",{"$f":"IFERROR(IF(F20=\"\",\"\",VLOOKUP(F20,'Reference Tables'!$D$137:$G$142,4,FALSE)),\"\")","v":9.9999999999999995E-7},null,"",null,{"$f":"IF(L20=\"\",\"\",IF($D20=\"\",L20,IF($D20=\"CO2e\",L20,L20*HLOOKUP($E20,'Reference Tables'!$F$85:$I$105,4,FALSE))))","v":""},"",null,{"$f":"IF(O20=\"\",\"\",IF($D20=\"\",O20,IF($D20=\"CO2e\",O20,O20*HLOOKUP($E20,'Reference Tables'!$F$85:$I$105,5,FALSE))))","v":""},"",null,{"$f":"IF(R20=\"\",\"\",IF($D26=\"\",R20,IF($D26=\"CO2e\",R20,R20*HLOOKUP($E20,'Reference Tables'!$F$85:$I$105,7,FALSE))))","v":""},"",null,{"$f":"IF(U20=\"\",\"\",IF($D26=\"\",U20,IF($D26=\"CO2e\",U20,U20*HLOOKUP($E20,'Reference Tables'!$F$85:$I$105,8,FALSE))))","v":""},"",null,{"$f":"IF(X20=\"\",\"\",IF($D26=\"\",X20,IF($D26=\"CO2e\",X20,X20*HLOOKUP($E20,'Reference Tables'!$F$85:$I$105,9,FALSE))))","v":""},"",null,{"$f":"IF(AA20=\"\",\"\",IF($D26=\"\",AA20,IF($D26=\"CO2e\",AA20,AA20*HLOOKUP($E20,'Reference Tables'!$F$85:$I$105,10,FALSE))))","v":""},"",null,{"$f":"IF(AD20=\"\",\"\",IF($D26=\"\",AD20,IF($D26=\"CO2e\",AD20,AD20*HLOOKUP($E20,'Reference Tables'!$F$85:$I$105,11,FALSE))))","v":""},"",null,{"$f":"IF(AG20=\"\",\"\",IF($D26=\"\",AG20,IF($D26=\"CO2e\",AG20,AG20*HLOOKUP($E20,'Reference Tables'!$F$85:$I$105,12,FALSE))))","v":""},"",null,{"$f":"IF(AJ20=\"\",\"\",IF($D26=\"\",AJ20,IF($D26=\"CO2e\",AJ20,AJ20*HLOOKUP($E20,'Reference Tables'!$F$85:$I$105,13,FALSE))))","v":""},"",null,{"$f":"IF(AM20=\"\",\"\",IF($D26=\"\",AM20,IF($D26=\"CO2e\",AM20,AM20*HLOOKUP($E20,'Reference Tables'!$F$85:$I$105,14,FALSE))))","v":""},"",null,{"$f":"IF(AP20=\"\",\"\",IF($D26=\"\",AP20,IF($D26=\"CO2e\",AP20,AP20*HLOOKUP($E20,'Reference Tables'!$F$85:$I$105,15,FALSE))))","v":""},"",null,{"$f":"IF(AS20=\"\",\"\",IF($D26=\"\",AS20,IF($D26=\"CO2e\",AS20,AS20*HLOOKUP($E20,'Reference Tables'!$F$85:$I$105,16,FALSE))))","v":""},"",null,{"$f":"IF(AV20=\"\",\"\",IF($D26=\"\",AV20,IF($D26=\"CO2e\",AV20,AV20*HLOOKUP($E20,'Reference Tables'!$F$85:$I$105,17,FALSE))))","v":""},"",null,{"$f":"IF(AY20=\"\",\"\",IF($D26=\"\",AY20,IF($D26=\"CO2e\",AY20,AY20*HLOOKUP($E20,'Reference Tables'!$F$85:$I$105,18,FALSE))))","v":""},"",null,{"$f":"IF(BB20=\"\",\"\",IF($D26=\"\",BB20,IF($D26=\"CO2e\",BB20,BB20*HLOOKUP($E20,'Reference Tables'!$F$85:$I$105,19,FALSE))))","v":""},"",null,{"$f":"IF(BE20=\"\",\"\",IF($D26=\"\",BE20,IF($D26=\"CO2e\",BE20,BE20*HLOOKUP($E20,'Reference Tables'!$F$85:$I$105,20,FALSE))))","v":""},"",null,{"$f":"IF(BH20=\"\",\"\",IF($D26=\"\",BH20,IF($D26=\"CO2e\",BH20,BH20*HLOOKUP($E20,'Reference Tables'!$F$85:$I$105,6,FALSE))))","v":""},"",null,{"$f":"IF(BK20=\"\",\"\",IF($D26=\"\",BK20,IF($D26=\"CO2e\",BK20,BK20*HLOOKUP($E20,'Reference Tables'!$F$85:$I$105,6,FALSE))))","v":""},"",{"$f":"'[3]EF calculations'!$N$13","v":715.36528115468718},7.1536528115468713E-4,null,""]
[null,"Intercity bus emission factor - diesel","EF_intercity bus - diesel","CO2e","2AR","g","/","mile",{"$f":"IFERROR(IF(F21=\"\",\"\",VLOOKUP(F21,'Reference Tables'!$D$137:$G$142,4,FALSE)),\"\")","v":9.9999999999999995E-7},null,"",null,{"$f":"IF(L21=\"\",\"\",IF($D21=\"\",L21,IF($D21=\"CO2e\",L21,L21*HLOOKUP($E21,'Reference Tables'!$F$85:$I$105,4,FALSE))))","v":""},"",null,{"$f":"IF(O21=\"\",\"\",IF($D21=\"\",O21,IF($D21=\"CO2e\",O21,O21*HLOOKUP($E21,'Reference Tables'!$F$85:$I$105,5,FALSE))))","v":""},"",null,{"$f":"IF(R21=\"\",\"\",IF($D28=\"\",R21,IF($D28=\"CO2e\",R21,R21*HLOOKUP($E21,'Reference Tables'!$F$85:$I$105,7,FALSE))))","v":""},"",null,{"$f":"IF(U21=\"\",\"\",IF($D28=\"\",U21,IF($D28=\"CO2e\",U21,U21*HLOOKUP($E21,'Reference Tables'!$F$85:$I$105,8,FALSE))))","v":""},"",null,{"$f":"IF(X21=\"\",\"\",IF($D28=\"\",X21,IF($D28=\"CO2e\",X21,X21*HLOOKUP($E21,'Reference Tables'!$F$85:$I$105,9,FALSE))))","v":""},"",null,{"$f":"IF(AA21=\"\",\"\",IF($D28=\"\",AA21,IF($D28=\"CO2e\",AA21,AA21*HLOOKUP($E21,'Reference Tables'!$F$85:$I$105,10,FALSE))))","v":""},"",null,{"$f":"IF(AD21=\"\",\"\",IF($D28=\"\",AD21,IF($D28=\"CO2e\",AD21,AD21*HLOOKUP($E21,'Reference Tables'!$F$85:$I$105,11,FALSE))))","v":""},"",null,{"$f":"IF(AG21=\"\",\"\",IF($D28=\"\",AG21,IF($D28=\"CO2e\",AG21,AG21*HLOOKUP($E21,'Reference Tables'!$F$85:$I$105,12,FALSE))))","v":""},"",null,{"$f":"IF(AJ21=\"\",\"\",IF($D28=\"\",AJ21,IF($D28=\"CO2e\",AJ21,AJ21*HLOOKUP($E21,'Reference Tables'!$F$85:$I$105,13,FALSE))))","v":""},"",null,{"$f":"IF(AM21=\"\",\"\",IF($D28=\"\",AM21,IF($D28=\"CO2e\",AM21,AM21*HLOOKUP($E21,'Reference Tables'!$F$85:$I$105,14,FALSE))))","v":""},"",null,{"$f":"IF(AP21=\"\",\"\",IF($D28=\"\",AP21,IF($D28=\"CO2e\",AP21,AP21*HLOOKUP($E21,'Reference Tables'!$F$85:$I$105,15,FALSE))))","v":""},"",null,{"$f":"IF(AS21=\"\",\"\",IF($D28=\"\",AS21,IF($D28=\"CO2e\",AS21,AS21*HLOOKUP($E21,'Reference Tables'!$F$85:$I$105,16,FALSE))))","v":""},"",null,{"$f":"IF(AV21=\"\",\"\",IF($D28=\"\",AV21,IF($D28=\"CO2e\",AV21,AV21*HLOOKUP($E21,'Reference Tables'!$F$85:$I$105,17,FALSE))))","v":""},"",null,{"$f":"IF(AY21=\"\",\"\",IF($D28=\"\",AY21,IF($D28=\"CO2e\",AY21,AY21*HLOOKUP($E21,'Reference Tables'!$F$85:$I$105,18,FALSE))))","v":""},"",null,{"$f":"IF(BB21=\"\",\"\",IF($D28=\"\",BB21,IF($D28=\"CO2e\",BB21,BB21*HLOOKUP($E21,'Reference Tables'!$F$85:$I$105,19,FALSE))))","v":""},"",null,{"$f":"IF(BE21=\"\",\"\",IF($D28=\"\",BE21,IF($D28=\"CO2e\",BE21,BE21*HLOOKUP($E21,'Reference Tables'!$F$85:$I$105,20,FALSE))))","v":""},"",null,{"$f":"IF(BH21=\"\",\"\",IF($D28=\"\",BH21,IF($D28=\"CO2e\",BH21,BH21*HLOOKUP($E21,'Reference Tables'!$F$85:$I$105,6,FALSE))))","v":""},"",null,{"$f":"IF(BK21=\"\",\"\",IF($D28=\"\",BK21,IF($D28=\"CO2e\",BK21,BK21*HLOOKUP($E21,'Reference Tables'!$F$85:$I$105,6,FALSE))))","v":""},"",{"$f":"'[3]EF calculations'!$N$14","v":1897.5550919793886},1.8975550919793885E-3,null,""]
[null,"Transit bus emission factor - diesel","EF_transit bus - diesel","CO2e","2AR","g","/","mile",{"$f":"IFERROR(IF(F22=\"\",\"\",VLOOKUP(F22,'Reference Tables'!$D$137:$G$142,4,FALSE)),\"\")","v":9.9999999999999995E-7},null,"",null,{"$f":"IF(L22=\"\",\"\",IF($D22=\"\",L22,IF($D22=\"CO2e\",L22,L22*HLOOKUP($E22,'Reference Tables'!$F$85:$I$105,4,FALSE))))","v":""},"",null,{"$f":"IF(O22=\"\",\"\",IF($D22=\"\",O22,IF($D22=\"CO2e\",O22,O22*HLOOKUP($E22,'Reference Tables'!$F$85:$I$105,5,FALSE))))","v":""},"",null,{"$f":"IF(R22=\"\",\"\",IF($D30=\"\",R22,IF($D30=\"CO2e\",R22,R22*HLOOKUP($E22,'Reference Tables'!$F$85:$I$105,7,FALSE))))","v":""},"",null,{"$f":"IF(U22=\"\",\"\",IF($D30=\"\",U22,IF($D30=\"CO2e\",U22,U22*HLOOKUP($E22,'Reference Tables'!$F$85:$I$105,8,FALSE))))","v":""},"",null,{"$f":"IF(X22=\"\",\"\",IF($D30=\"\",X22,IF($D30=\"CO2e\",X22,X22*HLOOKUP($E22,'Reference Tables'!$F$85:$I$105,9,FALSE))))","v":""},"",null,{"$f":"IF(AA22=\"\",\"\",IF($D30=\"\",AA22,IF($D30=\"CO2e\",AA22,AA22*HLOOKUP($E22,'Reference Tables'!$F$85:$I$105,10,FALSE))))","v":""},"",null,{"$f":"IF(AD22=\"\",\"\",IF($D30=\"\",AD22,IF($D30=\"CO2e\",AD22,AD22*HLOOKUP($E22,'Reference Tables'!$F$85:$I$105,11,FALSE))))","v":""},"",null,{"$f":"IF(AG22=\"\",\"\",IF($D30=\"\",AG22,IF($D30=\"CO2e\",AG22,AG22*HLOOKUP($E22,'Reference Tables'!$F$85:$I$105,12,FALSE))))","v":""},"",null,{"$f":"IF(AJ22=\"\",\"\",IF($D30=\"\",AJ22,IF($D30=\"CO2e\",AJ22,AJ22*HLOOKUP($E22,'Reference Tables'!$F$85:$I$105,13,FALSE))))","v":""},"",null,{"$f":"IF(AM22=\"\",\"\",IF($D30=\"\",AM22,IF($D30=\"CO2e\",AM22,AM22*HLOOKUP($E22,'Reference Tables'!$F$85:$I$105,14,FALSE))))","v":""},"",null,{"$f":"IF(AP22=\"\",\"\",IF($D30=\"\",AP22,IF($D30=\"CO2e\",AP22,AP22*HLOOKUP($E22,'Reference Tables'!$F$85:$I$105,15,FALSE))))","v":""},"",null,{"$f":"IF(AS22=\"\",\"\",IF($D30=\"\",AS22,IF($D30=\"CO2e\",AS22,AS22*HLOOKUP($E22,'Reference Tables'!$F$85:$I$105,16,FALSE))))","v":""},"",null,{"$f":"IF(AV22=\"\",\"\",IF($D30=\"\",AV22,IF($D30=\"CO2e\",AV22,AV22*HLOOKUP($E22,'Reference Tables'!$F$85:$I$105,17,FALSE))))","v":""},"",null,{"$f":"IF(AY22=\"\",\"\",IF($D30=\"\",AY22,IF($D30=\"CO2e\",AY22,AY22*HLOOKUP($E22,'Reference Tables'!$F$85:$I$105,18,FALSE))))","v":""},"",null,{"$f":"IF(BB22=\"\",\"\",IF($D30=\"\",BB22,IF($D30=\"CO2e\",BB22,BB22*HLOOKUP($E22,'Reference Tables'!$F$85:$I$105,19,FALSE))))","v":""},"",null,{"$f":"IF(BE22=\"\",\"\",IF($D30=\"\",BE22,IF($D30=\"CO2e\",BE22,BE22*HLOOKUP($E22,'Reference Tables'!$F$85:$I$105,20,FALSE))))","v":""},"",null,{"$f":"IF(BH22=\"\",\"\",IF($D30=\"\",BH22,IF($D30=\"CO2e\",BH22,BH22*HLOOKUP($E22,'Reference Tables'!$F$85:$I$105,6,FALSE))))","v":""},"",null,{"$f":"IF(BK22=\"\",\"\",IF($D30=\"\",BK22,IF($D30=\"CO2e\",BK22,BK22*HLOOKUP($E22,'Reference Tables'!$F$85:$I$105,6,FALSE))))","v":""},"",{"$f":"'[3]EF calculations'!$N$15","v":1266.2504342259324},1.2662504342259324E-3,null,""]
[null,"School bus emission factor - gasoline","EF_school bus - gasoline","CO2e","2AR","g",{"$f":"IF(F23=\"\",\"\",\"/\")","v":"/"},"mile",{"$f":"IFERROR(IF(F23=\"\",\"\",VLOOKUP(F23,'Reference Tables'!$D$137:$G$142,4,FALSE)),\"\")","v":9.9999999999999995E-7},null,"",null,{"$f":"IF(L23=\"\",\"\",IF($D23=\"\",L23,IF($D23=\"CO2e\",L23,L23*HLOOKUP($E23,'Reference Tables'!$F$85:$I$105,4,FALSE))))","v":""},"",null,{"$f":"IF(O23=\"\",\"\",IF($D23=\"\",O23,IF($D23=\"CO2e\",O23,O23*HLOOKUP($E23,'Reference Tables'!$F$85:$I$105,5,FALSE))))","v":""},"",null,null,null,null,null,null,null,null,null,null,null,null,null,null,null,null,null,null,null,null,null,null,null,null,null,null,null,null,null,null,null,null,null,null,null,null,null,null,null,null,null,null,null,null,null,null,null,null,{"$f":"'[3]EF calculations'!$J$16","v":881.93137133362438},8.819313713336243E-4,null,""]
[null,"School bus emission factor - diesel","EF_school bus - diesel","CO2e","2AR","g",{"$f":"IF(F24=\"\",\"\",\"/\")","v":"/"},"mile",{"$f":"IFERROR(IF(F24=\"\",\"\",VLOOKUP(F24,'Reference Tables'!$D$137:$G$142,4,FALSE)),\"\")","v":9.9999999999999995E-7},null,"",null,{"$f":"IF(L24=\"\",\"\",IF($D24=\"\",L24,IF($D24=\"CO2e\",L24,L24*HLOOKUP($E24,'Reference Tables'!$F$85:$I$105,4,FALSE))))","v":""},"",null,{"$f":"IF(O24=\"\",\"\",IF($D24=\"\",O24,IF($D24=\"CO2e\",O24,O24*HLOOKUP($E24,'Reference Tables'!$F$85:$I$105,5,FALSE))))","v":""},"",null,{"$f":"IF(R24=\"\",\"\",IF(#REF!=\"\",R24,IF(#REF!=\"CO2e\",R24,R24*HLOOKUP($E24,'Reference Tables'!$F$85:$I$105,7,FALSE))))","v":""},"",null,{"$f":"IF(U24=\"\",\"\",IF(#REF!=\"\",U24,IF(#REF!=\"CO2e\",U24,U24*HLOOKUP($E24,'Reference Tables'!$F$85:$I$105,8,FALSE))))","v":""},"",null,{"$f":"IF(X24=\"\",\"\",IF(#REF!=\"\",X24,IF(#REF!=\"CO2e\",X24,X24*HLOOKUP($E24,'Reference Tables'!$F$85:$I$105,9,FALSE))))","v":""},"",null,{"$f":"IF(AA24=\"\",\"\",IF(#REF!=\"\",AA24,IF(#REF!=\"CO2e\",AA24,AA24*HLOOKUP($E24,'Reference Tables'!$F$85:$I$105,10,FALSE))))","v":""},"",null,{"$f":"IF(AD24=\"\",\"\",IF(#REF!=\"\",AD24,IF(#REF!=\"CO2e\",AD24,AD24*HLOOKUP($E24,'Reference Tables'!$F$85:$I$105,11,FALSE))))","v":""},"",null,{"$f":"IF(AG24=\"\",\"\",IF(#REF!=\"\",AG24,IF(#REF!=\"CO2e\",AG24,AG24*HLOOKUP($E24,'Reference Tables'!$F$85:$I$105,12,FALSE))))","v":""},"",null,{"$f":"IF(AJ24=\"\",\"\",IF(#REF!=\"\",AJ24,IF(#REF!=\"CO2e\",AJ24,AJ24*HLOOKUP($E24,'Reference Tables'!$F$85:$I$105,13,FALSE))))","v":""},"",null,{"$f":"IF(AM24=\"\",\"\",IF(#REF!=\"\",AM24,IF(#REF!=\"CO2e\",AM24,AM24*HLOOKUP($E24,'Reference Tables'!$F$85:$I$105,14,FALSE))))","v":""},"",null,{"$f":"IF(AP24=\"\",\"\",IF(#REF!=\"\",AP24,IF(#REF!=\"CO2e\",AP24,AP24*HLOOKUP($E24,'Reference Tables'!$F$85:$I$105,15,FALSE))))","v":""},"",null,{"$f":"IF(AS24=\"\",\"\",IF(#REF!=\"\",AS24,IF(#REF!=\"CO2e\",AS24,AS24*HLOOKUP($E24,'Reference Tables'!$F$85:$I$105,16,FALSE))))","v":""},"",null,{"$f":"IF(AV24=\"\",\"\",IF(#REF!=\"\",AV24,IF(#REF!=\"CO2e\",AV24,AV24*HLOOKUP($E24,'Reference Tables'!$F$85:$I$105,17,FALSE))))","v":""},"",null,{"$f":"IF(AY24=\"\",\"\",IF(#REF!=\"\",AY24,IF(#REF!=\"CO2e\",AY24,AY24*HLOOKUP($E24,'Reference Tables'!$F$85:$I$105,18,FALSE))))","v":""},"",null,{"$f":"IF(BB24=\"\",\"\",IF(#REF!=\"\",BB24,IF(#REF!=\"CO2e\",BB24,BB24*HLOOKUP($E24,'Reference Tables'!$F$85:$I$105,19,FALSE))))","v":""},"",null,{"$f":"IF(BE24=\"\",\"\",IF(#REF!=\"\",BE24,IF(#REF!=\"CO2e\",BE24,BE24*HLOOKUP($E24,'Reference Tables'!$F$85:$I$105,20,FALSE))))","v":""},"",null,{"$f":"IF(BH24=\"\",\"\",IF(#REF!=\"\",BH24,IF(#REF!=\"CO2e\",BH24,BH24*HLOOKUP($E24,'Reference Tables'!$F$85:$I$105,6,FALSE))))","v":""},"",null,{"$f":"IF(BK24=\"\",\"\",IF(#REF!=\"\",BK24,IF(#REF!=\"CO2e\",BK24,BK24*HLOOKUP($E24,'Reference Tables'!$F$85:$I$105,6,FALSE))))","v":""},"",{"$f":"'[3]EF calculations'!$N$16","v":938.32190100646278},9.3832190100646279E-4,null,""]
[null,"Refuse truck emission factor","EF_refuse truck - diesel","CO2e","2AR","g","/","mile",{"$f":"IFERROR(IF(F25=\"\",\"\",VLOOKUP(F25,'Reference Tables'!$D$137:$G$142,4,FALSE)),\"\")","v":9.9999999999999995E-7},null,"",null,{"$f":"IF(L25=\"\",\"\",IF($D25=\"\",L25,IF($D25=\"CO2e\",L25,L25*HLOOKUP($E25,'Reference Tables'!$F$85:$I$105,4,FALSE))))","v":""},"",null,{"$f":"IF(O25=\"\",\"\",IF($D25=\"\",O25,IF($D25=\"CO2e\",O25,O25*HLOOKUP($E25,'Reference Tables'!$F$85:$I$105,5,FALSE))))","v":""},"",null,{"$f":"IF(R25=\"\",\"\",IF(#REF!=\"\",R25,IF(#REF!=\"CO2e\",R25,R25*HLOOKUP($E25,'Reference Tables'!$F$85:$I$105,7,FALSE))))","v":""},"",null,{"$f":"IF(U25=\"\",\"\",IF(#REF!=\"\",U25,IF(#REF!=\"CO2e\",U25,U25*HLOOKUP($E25,'Reference Tables'!$F$85:$I$105,8,FALSE))))","v":""},"",null,{"$f":"IF(X25=\"\",\"\",IF(#REF!=\"\",X25,IF(#REF!=\"CO2e\",X25,X25*HLOOKUP($E25,'Reference Tables'!$F$85:$I$105,9,FALSE))))","v":""},"",null,{"$f":"IF(AA25=\"\",\"\",IF(#REF!=\"\",AA25,IF(#REF!=\"CO2e\",AA25,AA25*HLOOKUP($E25,'Reference Tables'!$F$85:$I$105,10,FALSE))))","v":""},"",null,{"$f":"IF(AD25=\"\",\"\",IF(#REF!=\"\",AD25,IF(#REF!=\"CO2e\",AD25,AD25*HLOOKUP($E25,'Reference Tables'!$F$85:$I$105,11,FALSE))))","v":""},"",null,{"$f":"IF(AG25=\"\",\"\",IF(#REF!=\"\",AG25,IF(#REF!=\"CO2e\",AG25,AG25*HLOOKUP($E25,'Reference Tables'!$F$85:$I$105,12,FALSE))))","v":""},"",null,{"$f":"IF(AJ25=\"\",\"\",IF(#REF!=\"\",AJ25,IF(#REF!=\"CO2e\",AJ25,AJ25*HLOOKUP($E25,'Reference Tables'!$F$85:$I$105,13,FALSE))))","v":""},"",null,{"$f":"IF(AM25=\"\",\"\",IF(#REF!=\"\",AM25,IF(#REF!=\"CO2e\",AM25,AM25*HLOOKUP($E25,'Reference Tables'!$F$85:$I$105,14,FALSE))))","v":""},"",null,{"$f":"IF(AP25=\"\",\"\",IF(#REF!=\"\",AP25,IF(#REF!=\"CO2e\",AP25,AP25*HLOOKUP($E25,'Reference Tables'!$F$85:$I$105,15,FALSE))))","v":""},"",null,{"$f":"IF(AS25=\"\",\"\",IF(#REF!=\"\",AS25,IF(#REF!=\"CO2e\",AS25,AS25*HLOOKUP($E25,'Reference Tables'!$F$85:$I$105,16,FALSE))))","v":""},"",null,{"$f":"IF(AV25=\"\",\"\",IF(#REF!=\"\",AV25,IF(#REF!=\"CO2e\",AV25,AV25*HLOOKUP($E25,'Reference Tables'!$F$85:$I$105,17,FALSE))))","v":""},"",null,{"$f":"IF(AY25=\"\",\"\",IF(#REF!=\"\",AY25,IF(#REF!=\"CO2e\",AY25,AY25*HLOOKUP($E25,'Reference Tables'!$F$85:$I$105,18,FALSE))))","v":""},"",null,{"$f":"IF(BB25=\"\",\"\",IF(#REF!=\"\",BB25,IF(#REF!=\"CO2e\",BB25,BB25*HLOOKUP($E25,'Reference Tables'!$F$85:$I$105,19,FALSE))))","v":""},"",null,{"$f":"IF(BE25=\"\",\"\",IF(#REF!=\"\",BE25,IF(#REF!=\"CO2e\",BE25,BE25*HLOOKUP($E25,'Reference Tables'!$F$85:$I$105,20,FALSE))))","v":""},"",null,{"$f":"IF(BH25=\"\",\"\",IF(#REF!=\"\",BH25,IF(#REF!=\"CO2e\",BH25,BH25*HLOOKUP($E25,'Reference Tables'!$F$85:$I$105,6,FALSE))))","v":""},"",null,{"$f":"IF(BK25=\"\",\"\",IF(#REF!=\"\",BK25,IF(#REF!=\"CO2e\",BK25,BK25*HLOOKUP($E25,'Reference Tables'!$F$85:$I$105,6,FALSE))))","v":""},"",{"$f":"'[3]EF calculations'!$N$17","v":1776.8988900772097},1.7768988900772097E-3,null,""]
[null,"Single unit short-haul truck emission factor - gasoline","EF_single unit short haul truck - gasoline","CO2e","2AR","g","/","mile",{"$f":"IFERROR(IF(F26=\"\",\"\",VLOOKUP(F26,'Reference Tables'!$D$137:$G$142,4,FALSE)),\"\")","v":9.9999999999999995E-7},null,"",null,{"$f":"IF(L26=\"\",\"\",IF($D26=\"\",L26,IF($D26=\"CO2e\",L26,L26*HLOOKUP($E26,'Reference Tables'!$F$85:$I$105,4,FALSE))))","v":""},"",null,{"$f":"IF(O26=\"\",\"\",IF($D26=\"\",O26,IF($D26=\"CO2e\",O26,O26*HLOOKUP($E26,'Reference Tables'!$F$85:$I$105,5,FALSE))))","v":""},"",null,{"$f":"IF(R26=\"\",\"\",IF(#REF!=\"\",R26,IF(#REF!=\"CO2e\",R26,R26*HLOOKUP($E26,'Reference Tables'!$F$85:$I$105,7,FALSE))))","v":""},"",null,{"$f":"IF(U26=\"\",\"\",IF(#REF!=\"\",U26,IF(#REF!=\"CO2e\",U26,U26*HLOOKUP($E26,'Reference Tables'!$F$85:$I$105,8,FALSE))))","v":""},"",null,{"$f":"IF(X26=\"\",\"\",IF(#REF!=\"\",X26,IF(#REF!=\"CO2e\",X26,X26*HLOOKUP($E26,'Reference Tables'!$F$85:$I$105,9,FALSE))))","v":""},"",null,{"$f":"IF(AA26=\"\",\"\",IF(#REF!=\"\",AA26,IF(#REF!=\"CO2e\",AA26,AA26*HLOOKUP($E26,'Reference Tables'!$F$85:$I$105,10,FALSE))))","v":""},"",null,{"$f":"IF(AD26=\"\",\"\",IF(#REF!=\"\",AD26,IF(#REF!=\"CO2e\",AD26,AD26*HLOOKUP($E26,'Reference Tables'!$F$85:$I$105,11,FALSE))))","v":""},"",null,{"$f":"IF(AG26=\"\",\"\",IF(#REF!=\"\",AG26,IF(#REF!=\"CO2e\",AG26,AG26*HLOOKUP($E26,'Reference Tables'!$F$85:$I$105,12,FALSE))))","v":""},"",null,{"$f":"IF(AJ26=\"\",\"\",IF(#REF!=\"\",AJ26,IF(#REF!=\"CO2e\",AJ26,AJ26*HLOOKUP($E26,'Reference Tables'!$F$85:$I$105,13,FALSE))))","v":""},"",null,{"$f":"IF(AM26=\"\",\"\",IF(#REF!=\"\",AM26,IF(#REF!=\"CO2e\",AM26,AM26*HLOOKUP($E26,'Reference Tables'!$F$85:$I$105,14,FALSE))))","v":""},"",null,{"$f":"IF(AP26=\"\",\"\",IF(#REF!=\"\",AP26,IF(#REF!=\"CO2e\",AP26,AP26*HLOOKUP($E26,'Reference Tables'!$F$85:$I$105,15,FALSE))))","v":""},"",null,{"$f":"IF(AS26=\"\",\"\",IF(#REF!=\"\",AS26,IF(#REF!=\"CO2e\",AS26,AS26*HLOOKUP($E26,'Reference Tables'!$F$85:$I$105,16,FALSE))))","v":""},"",null,{"$f":"IF(AV26=\"\",\"\",IF(#REF!=\"\",AV26,IF(#REF!=\"CO2e\",AV26,AV26*HLOOKUP($E26,'Reference Tables'!$F$85:$I$105,17,FALSE))))","v":""},"",null,{"$f":"IF(AY26=\"\",\"\",IF(#REF!=\"\",AY26,IF(#REF!=\"CO2e\",AY26,AY26*HLOOKUP($E26,'Reference Tables'!$F$85:$I$105,18,FALSE))))","v":""},"",null,{"$f":"IF(BB26=\"\",\"\",IF(#REF!=\"\",BB26,IF(#REF!=\"CO2e\",BB26,BB26*HLOOKUP($E26,'Reference Tables'!$F$85:$I$105,19,FALSE))))","v":""},"",null,{"$f":"IF(BE26=\"\",\"\",IF(#REF!=\"\",BE26,IF(#REF!=\"CO2e\",BE26,BE26*HLOOKUP($E26,'Reference Tables'!$F$85:$I$105,20,FALSE))))","v":""},"",null,{"$f":"IF(BH26=\"\",\"\",IF(#REF!=\"\",BH26,IF(#REF!=\"CO2e\",BH26,BH26*HLOOKUP($E26,'Reference Tables'!$F$85:$I$105,6,FALSE))))","v":""},"",null,{"$f":"IF(BK26=\"\",\"\",IF(#REF!=\"\",BK26,IF(#REF!=\"CO2e\",BK26,BK26*HLOOKUP($E26,'Reference Tables'!$F$85:$I$105,6,FALSE))))","v":""},"",{"$f":"'[3]EF calculations'!$J$18","v":1051.8240046968717},1.0518240046968716E-3,null,""]
[null,"Single unit short-haul truck emission factor - diesel","EF_single unit short haul truck - diesel","CO2e","2AR","g","/","mile",{"$f":"IFERROR(IF(F27=\"\",\"\",VLOOKUP(F27,'Reference Tables'!$D$137:$G$142,4,FALSE)),\"\")","v":9.9999999999999995E-7},null,"",null,{"$f":"IF(L27=\"\",\"\",IF($D27=\"\",L27,IF($D27=\"CO2e\",L27,L27*HLOOKUP($E27,'Reference Tables'!$F$85:$I$105,4,FALSE))))","v":""},"",null,{"$f":"IF(O27=\"\",\"\",IF($D27=\"\",O27,IF($D27=\"CO2e\",O27,O27*HLOOKUP($E27,'Reference Tables'!$F$85:$I$105,5,FALSE))))","v":""},"",null,{"$f":"IF(R27=\"\",\"\",IF(#REF!=\"\",R27,IF(#REF!=\"CO2e\",R27,R27*HLOOKUP($E27,'Reference Tables'!$F$85:$I$105,7,FALSE))))","v":""},"",null,{"$f":"IF(U27=\"\",\"\",IF(#REF!=\"\",U27,IF(#REF!=\"CO2e\",U27,U27*HLOOKUP($E27,'Reference Tables'!$F$85:$I$105,8,FALSE))))","v":""},"",null,{"$f":"IF(X27=\"\",\"\",IF(#REF!=\"\",X27,IF(#REF!=\"CO2e\",X27,X27*HLOOKUP($E27,'Reference Tables'!$F$85:$I$105,9,FALSE))))","v":""},"",null,{"$f":"IF(AA27=\"\",\"\",IF(#REF!=\"\",AA27,IF(#REF!=\"CO2e\",AA27,AA27*HLOOKUP($E27,'Reference Tables'!$F$85:$I$105,10,FALSE))))","v":""},"",null,{"$f":"IF(AD27=\"\",\"\",IF(#REF!=\"\",AD27,IF(#REF!=\"CO2e\",AD27,AD27*HLOOKUP($E27,'Reference Tables'!$F$85:$I$105,11,FALSE))))","v":""},"",null,{"$f":"IF(AG27=\"\",\"\",IF(#REF!=\"\",AG27,IF(#REF!=\"CO2e\",AG27,AG27*HLOOKUP($E27,'Reference Tables'!$F$85:$I$105,12,FALSE))))","v":""},"",null,{"$f":"IF(AJ27=\"\",\"\",IF(#REF!=\"\",AJ27,IF(#REF!=\"CO2e\",AJ27,AJ27*HLOOKUP($E27,'Reference Tables'!$F$85:$I$105,13,FALSE))))","v":""},"",null,{"$f":"IF(AM27=\"\",\"\",IF(#REF!=\"\",AM27,IF(#REF!=\"CO2e\",AM27,AM27*HLOOKUP($E27,'Reference Tables'!$F$85:$I$105,14,FALSE))))","v":""},"",null,{"$f":"IF(AP27=\"\",\"\",IF(#REF!=\"\",AP27,IF(#REF!=\"CO2e\",AP27,AP27*HLOOKUP($E27,'Reference Tables'!$F$85:$I$105,15,FALSE))))","v":""},"",null,{"$f":"IF(AS27=\"\",\"\",IF(#REF!=\"\",AS27,IF(#REF!=\"CO2e\",AS27,AS27*HLOOKUP($E27,'Reference Tables'!$F$85:$I$105,16,FALSE))))","v":""},"",null,{"$f":"IF(AV27=\"\",\"\",IF(#REF!=\"\",AV27,IF(#REF!=\"CO2e\",AV27,AV27*HLOOKUP($E27,'Reference Tables'!$F$85:$I$105,17,FALSE))))","v":""},"",null,{"$f":"IF(AY27=\"\",\"\",IF(#REF!=\"\",AY27,IF(#REF!=\"CO2e\",AY27,AY27*HLOOKUP($E27,'Reference Tables'!$F$85:$I$105,18,FALSE))))","v":""},"",null,{"$f":"IF(BB27=\"\",\"\",IF(#REF!=\"\",BB27,IF(#REF!=\"CO2e\",BB27,BB27*HLOOKUP($E27,'Reference Tables'!$F$85:$I$105,19,FALSE))))","v":""},"",null,{"$f":"IF(BE27=\"\",\"\",IF(#REF!=\"\",BE27,IF(#REF!=\"CO2e\",BE27,BE27*HLOOKUP($E27,'Reference Tables'!$F$85:$I$105,20,FALSE))))","v":""},"",null,{"$f":"IF(BH27=\"\",\"\",IF(#REF!=\"\",BH27,IF(#REF!=\"CO2e\",BH27,BH27*HLOOKUP($E27,'Reference Tables'!$F$85:$I$105,6,FALSE))))","v":""},"",null,{"$f":"IF(BK27=\"\",\"\",IF(#REF!=\"\",BK27,IF(#REF!=\"CO2e\",BK27,BK27*HLOOKUP($E27,'Reference Tables'!$F$85:$I$105,6,FALSE))))","v":""},"",{"$f":"'[3]EF calculations'!$N$18","v":1122.8798938417729},1.1228798938417728E-3,null,""]
[null,"Single unit long-haul truck emission factor - gasoline","EF_single unit long-haul truck - gasoline","CO2e","2AR","g","/","mile",{"$f":"IFERROR(IF(F28=\"\",\"\",VLOOKUP(F28,'Reference Tables'!$D$137:$G$142,4,FALSE)),\"\")","v":9.9999999999999995E-7},null,"",null,{"$f":"IF(L28=\"\",\"\",IF($D28=\"\",L28,IF($D28=\"CO2e\",L28,L28*HLOOKUP($E28,'Reference Tables'!$F$85:$I$105,4,FALSE))))","v":""},"",null,{"$f":"IF(O28=\"\",\"\",IF($D28=\"\",O28,IF($D28=\"CO2e\",O28,O28*HLOOKUP($E28,'Reference Tables'!$F$85:$I$105,5,FALSE))))","v":""},"",null,{"$f":"IF(R28=\"\",\"\",IF(#REF!=\"\",R28,IF(#REF!=\"CO2e\",R28,R28*HLOOKUP($E28,'Reference Tables'!$F$85:$I$105,7,FALSE))))","v":""},"",null,{"$f":"IF(U28=\"\",\"\",IF(#REF!=\"\",U28,IF(#REF!=\"CO2e\",U28,U28*HLOOKUP($E28,'Reference Tables'!$F$85:$I$105,8,FALSE))))","v":""},"",null,{"$f":"IF(X28=\"\",\"\",IF(#REF!=\"\",X28,IF(#REF!=\"CO2e\",X28,X28*HLOOKUP($E28,'Reference Tables'!$F$85:$I$105,9,FALSE))))","v":""},"",null,{"$f":"IF(AA28=\"\",\"\",IF(#REF!=\"\",AA28,IF(#REF!=\"CO2e\",AA28,AA28*HLOOKUP($E28,'Reference Tables'!$F$85:$I$105,10,FALSE))))","v":""},"",null,{"$f":"IF(AD28=\"\",\"\",IF(#REF!=\"\",AD28,IF(#REF!=\"CO2e\",AD28,AD28*HLOOKUP($E28,'Reference Tables'!$F$85:$I$105,11,FALSE))))","v":""},"",null,{"$f":"IF(AG28=\"\",\"\",IF(#REF!=\"\",AG28,IF(#REF!=\"CO2e\",AG28,AG28*HLOOKUP($E28,'Reference Tables'!$F$85:$I$105,12,FALSE))))","v":""},"",null,{"$f":"IF(AJ28=\"\",\"\",IF(#REF!=\"\",AJ28,IF(#REF!=\"CO2e\",AJ28,AJ28*HLOOKUP($E28,'Reference Tables'!$F$85:$I$105,13,FALSE))))","v":""},"",null,{"$f":"IF(AM28=\"\",\"\",IF(#REF!=\"\",AM28,IF(#REF!=\"CO2e\",AM28,AM28*HLOOKUP($E28,'Reference Tables'!$F$85:$I$105,14,FALSE))))","v":""},"",null,{"$f":"IF(AP28=\"\",\"\",IF(#REF!=\"\",AP28,IF(#REF!=\"CO2e\",AP28,AP28*HLOOKUP($E28,'Reference Tables'!$F$85:$I$105,15,FALSE))))","v":""},"",null,{"$f":"IF(AS28=\"\",\"\",IF(#REF!=\"\",AS28,IF(#REF!=\"CO2e\",AS28,AS28*HLOOKUP($E28,'Reference Tables'!$F$85:$I$105,16,FALSE))))","v":""},"",null,{"$f":"IF(AV28=\"\",\"\",IF(#REF!=\"\",AV28,IF(#REF!=\"CO2e\",AV28,AV28*HLOOKUP($E28,'Reference Tables'!$F$85:$I$105,17,FALSE))))","v":""},"",null,{"$f":"IF(AY28=\"\",\"\",IF(#REF!=\"\",AY28,IF(#REF!=\"CO2e\",AY28,AY28*HLOOKUP($E28,'Reference Tables'!$F$85:$I$105,18,FALSE))))","v":""},"",null,{"$f":"IF(BB28=\"\",\"\",IF(#REF!=\"\",BB28,IF(#REF!=\"CO2e\",BB28,BB28*HLOOKUP($E28,'Reference Tables'!$F$85:$I$105,19,FALSE))))","v":""},"",null,{"$f":"IF(BE28=\"\",\"\",IF(#REF!=\"\",BE28,IF(#REF!=\"CO2e\",BE28,BE28*HLOOKUP($E28,'Reference Tables'!$F$85:$I$105,20,FALSE))))","v":""},"",null,{"$f":"IF(BH28=\"\",\"\",IF(#REF!=\"\",BH28,IF(#REF!=\"CO2e\",BH28,BH28*HLOOKUP($E28,'Reference Tables'!$F$85:$I$105,6,FALSE))))","v":""},"",null,{"$f":"IF(BK28=\"\",\"\",IF(#REF!=\"\",BK28,IF(#REF!=\"CO2e\",BK28,BK28*HLOOKUP($E28,'Reference Tables'!$F$85:$I$105,6,FALSE))))","v":""},"",{"$f":"'[3]EF calculations'!$J$19","v":989.00305670725174},9.8900305670725176E-4,null,""]
[null,"Single unit long-haul truck emission factor - diesel","EF_single unit long-haul truck - diesel","CO2e","2AR","g","/","mile",{"$f":"IFERROR(IF(F29=\"\",\"\",VLOOKUP(F29,'Reference Tables'!$D$137:$G$142,4,FALSE)),\"\")","v":9.9999999999999995E-7},null,"",null,{"$f":"IF(L29=\"\",\"\",IF($D29=\"\",L29,IF($D29=\"CO2e\",L29,L29*HLOOKUP($E29,'Reference Tables'!$F$85:$I$105,4,FALSE))))","v":""},"",null,{"$f":"IF(O29=\"\",\"\",IF($D29=\"\",O29,IF($D29=\"CO2e\",O29,O29*HLOOKUP($E29,'Reference Tables'!$F$85:$I$105,5,FALSE))))","v":""},"",null,"","",null,"","",null,"","",null,"",null,null,null,null,null,null,null,null,null,null,null,null,null,null,null,null,null,null,null,null,null,null,null,null,null,null,null,null,null,null,null,null,null,null,null,null,null,{"$f":"'[3]EF calculations'!$N$19","v":1067.7835858651006},1.0677835858651005E-3,null,""]
[null,"Motor home emission factor - gasoline","EF_motor home - gasoline","CO2e","2AR","g","/","mile",{"$f":"IFERROR(IF(F30=\"\",\"\",VLOOKUP(F30,'Reference Tables'!$D$137:$G$142,4,FALSE)),\"\")","v":9.9999999999999995E-7},null,"",null,{"$f":"IF(L30=\"\",\"\",IF($D30=\"\",L30,IF($D30=\"CO2e\",L30,L30*HLOOKUP($E30,'Reference Tables'!$F$85:$I$105,4,FALSE))))","v":""},"",null,{"$f":"IF(O30=\"\",\"\",IF($D30=\"\",O30,IF($D30=\"CO2e\",O30,O30*HLOOKUP($E30,'Reference Tables'!$F$85:$I$105,5,FALSE))))","v":""},"",null,null,null,null,null,null,null,null,null,null,"",null,null,null,null,null,null,null,null,null,null,null,null,null,null,null,null,null,null,null,null,null,null,null,null,null,null,null,null,null,null,null,null,null,null,null,null,null,{"$f":"'[3]EF calculations'!$J$20","v":1055.7361471729334},1.0557361471729334E-3,null,""]
[null,"Motor home emission factor - diesel","EF_motor home - diesel","CO2e","2AR","g","/","mile",{"$f":"IFERROR(IF(F31=\"\",\"\",VLOOKUP(F31,'Reference Tables'!$D$137:$G$142,4,FALSE)),\"\")","v":9.9999999999999995E-7},null,"",null,{"$f":"IF(L31=\"\",\"\",IF($D31=\"\",L31,IF($D31=\"CO2e\",L31,L31*HLOOKUP($E31,'Reference Tables'!$F$85:$I$105,4,FALSE))))","v":""},"",null,{"$f":"IF(O31=\"\",\"\",IF($D31=\"\",O31,IF($D31=\"CO2e\",O31,O31*HLOOKUP($E31,'Reference Tables'!$F$85:$I$105,5,FALSE))))","v":""},"",null,null,null,null,null,null,null,null,null,null,"",null,null,null,null,null,null,null,null,null,null,null,null,null,null,null,null,null,null,null,null,null,null,null,null,null,null,null,null,null,null,null,null,null,null,null,null,null,{"$f":"'[3]EF calculations'!$N$20","v":1142.5424580070446},1.1425424580070445E-3,null,""]
[null,"Combination short-haul truck emission factor - gasoline","EF_combination short-haul truck - gasoline","CO2e","2AR","g","/","mile",{"$f":"IFERROR(IF(F32=\"\",\"\",VLOOKUP(F32,'Reference Tables'!$D$137:$G$142,4,FALSE)),\"\")","v":9.9999999999999995E-7},null,"",null,{"$f":"IF(L32=\"\",\"\",IF($D32=\"\",L32,IF($D32=\"CO2e\",L32,L32*HLOOKUP($E32,'Reference Tables'!$F$85:$I$105,4,FALSE))))","v":""},"",null,{"$f":"IF(O32=\"\",\"\",IF($D32=\"\",O32,IF($D32=\"CO2e\",O32,O32*HLOOKUP($E32,'Reference Tables'!$F$85:$I$105,5,FALSE))))","v":""},"",null,null,null,null,null,null,null,null,null,null,"",null,null,null,null,null,null,null,null,null,null,null,null,null,null,null,null,null,null,null,null,null,null,null,null,null,null,null,null,null,null,null,null,null,null,null,null,null,{"$f":"'[3]EF calculations'!$J$21","v":2063.4997228983793},2.0634997228983791E-3,null,""]
[null,"Combination short-haul truck emission factor - diesel","EF_combination short-haul truck - diesel","CO2e","2AR","g","/","mile",{"$f":"IFERROR(IF(F33=\"\",\"\",VLOOKUP(F33,'Reference Tables'!$D$137:$G$142,4,FALSE)),\"\")","v":9.9999999999999995E-7},null,"",null,{"$f":"IF(L33=\"\",\"\",IF($D33=\"\",L33,IF($D33=\"CO2e\",L33,L33*HLOOKUP($E33,'Reference Tables'!$F$85:$I$105,4,FALSE))))","v":""},"",null,{"$f":"IF(O33=\"\",\"\",IF($D33=\"\",O33,IF($D33=\"CO2e\",O33,O33*HLOOKUP($E33,'Reference Tables'!$F$85:$I$105,5,FALSE))))","v":""},"",null,null,null,null,null,null,null,null,null,null,"",null,null,null,null,null,null,null,null,null,null,null,null,null,null,null,null,null,null,null,null,null,null,null,null,null,null,null,null,null,null,null,null,null,null,null,null,null,{"$f":"'[3]EF calculations'!$N$21","v":2143.7020581771653},2.1437020581771653E-3,null,""]
[null,"Combination long-haul truck - diesel","EF_combination long-haul truck - diesel","CO2e","2AR","g",{"$f":"IF(F34=\"\",\"\",\"/\")","v":"/"},"mile",{"$f":"IFERROR(IF(F34=\"\",\"\",VLOOKUP(F34,'Reference Tables'!$D$137:$G$142,4,FALSE)),\"\")","v":9.9999999999999995E-7},null,"",null,{"$f":"IF(L34=\"\",\"\",IF($D34=\"\",L34,IF($D34=\"CO2e\",L34,L34*HLOOKUP($E34,'Reference Tables'!$F$85:$I$105,4,FALSE))))","v":""},"",null,{"$f":"IF(O34=\"\",\"\",IF($D34=\"\",O34,IF($D34=\"CO2e\",O34,O34*HLOOKUP($E34,'Reference Tables'!$F$85:$I$105,5,FALSE))))","v":""},"",null,null,null,null,null,null,null,null,null,null,"",null,null,null,null,null,null,null,null,null,null,null,null,null,null,null,null,null,null,null,null,null,null,null,null,null,null,null,null,null,null,null,null,null,null,null,null,null,{"$f":"'[3]EF calculations'!$N$22","v":2231.2686090655584},2.2312686090655582E-3,null,""]
[null,"Transit electricity emission factor","EF_electricity - transit","CO2e","2AR","t","/","MWH",{"$f":"IFERROR(IF(F35=\"\",\"\",VLOOKUP(F35,'Reference Tables'!$D$137:$G$142,4,FALSE)),\"\")","v":1},null,"",null,{"$f":"IF(L35=\"\",\"\",IF($D35=\"\",L35,IF($D35=\"CO2e\",L35,L35*HLOOKUP($E35,'Reference Tables'!$F$85:$I$105,4,FALSE))))","v":""},"",null,{"$f":"IF(O35=\"\",\"\",IF($D35=\"\",O35,IF($D35=\"CO2e\",O35,O35*HLOOKUP($E35,'Reference Tables'!$F$85:$I$105,5,FALSE))))","v":""},"",null,null,null,null,null,null,null,null,null,null,"",null,null,null,null,null,null,null,null,null,null,null,null,null,null,null,null,null,null,null,null,null,null,null,null,null,null,null,null,null,null,null,null,null,null,null,null,null,{"$f":"'[4]Transit emissions-v5-03-01-12'!$N$10","v":0.61669683023167798},0.61669683023167798,null,""]
[null,"Wastewater natural gas emission factor","EF_natural gas_wastewater","GHG","2AR","kg","/","MMBtu",{"$f":"IFERROR(IF(F36=\"\",\"\",VLOOKUP(F36,'Reference Tables'!$D$137:$G$142,4,FALSE)),\"\")","v":1E-3},{"$f":"[5]!kgCO2_MMBTU","v":53.02},5.3020000000000005E-2,{"$f":"[5]!kgCH4_MMBTU","v":1E-3},{"$f":"IF(L36=\"\",\"\",IF($D36=\"\",L36,IF($D36=\"CO2e\",L36,L36*HLOOKUP($E36,'Reference Tables'!$F$85:$I$105,4,FALSE))))","v":2.1000000000000001E-2},2.1000000000000002E-5,{"$f":"[5]!kgN2O_MMBTU","v":1E-4},{"$f":"IF(O36=\"\",\"\",IF($D36=\"\",O36,IF($D36=\"CO2e\",O36,O36*HLOOKUP($E36,'Reference Tables'!$F$85:$I$105,5,FALSE))))","v":3.1E-2},3.1000000000000001E-5,null,null,null,null,null,null,null,null,null,null,null,null,null,null,null,null,null,null,null,null,null,null,null,null,null,null,null,null,null,null,null,null,null,null,null,null,null,null,null,null,null,null,null,null,null,null,null,null,null,"",null,""]
[null,"Water natural gas emission factor","EF_natural gas water","GHG","2AR","lb","/","10 cubic feet",{"$f":"IFERROR(IF(F37=\"\",\"\",VLOOKUP(F37,'Reference Tables'!$D$137:$G$142,4,FALSE)),\"\")","v":4.5359237038037839E-4},{"$f":"[6]!NaturalGas_lbsCO2_10cubicfeet","v":120000},54.431084445645403,{"$f":"[6]!NaturalGas_lbsCH4_10cubicfeet","v":2.2999999999999998},{"$f":"IF(L37=\"\",\"\",IF($D37=\"\",L37,IF($D37=\"CO2e\",L37,L37*HLOOKUP($E37,'Reference Tables'!$F$85:$I$105,4,FALSE))))","v":48.3},{"$f":"IFERROR(IF(M37=\"\",\"\",M37*$I37),\"\")","v":2.1908511489372274E-2},{"$f":"[6]!NaturalGas_lbsN2O_10cubicfeet","v":2.2000000000000002},{"$f":"IF(O37=\"\",\"\",IF($D37=\"\",O37,IF($D37=\"CO2e\",O37,O37*HLOOKUP($E37,'Reference Tables'!$F$85:$I$105,5,FALSE))))","v":682},{"$f":"IFERROR(IF(P37=\"\",\"\",P37*$I37),\"\")","v":0.30934999659941809},null,null,null,null,null,null,null,null,null,null,"",null,null,null,null,null,null,null,null,null,null,null,null,null,null,null,null,null,null,null,null,null,null,null,null,null,null,null,null,null,null,null,null,null,null,null,null,null,null,"",null,""]
[null,"Water boilers fuel oil emission factor","EF_fuel oil water boilers","GHG","2AR","lb","/","1000 gallons",{"$f":"IFERROR(IF(F38=\"\",\"\",VLOOKUP(F38,'Reference Tables'!$D$137:$G$142,4,FALSE)),\"\")","v":4.5359237038037839E-4},{"$f":"[6]!FuelOil2_Boiler_lbsCO2_1000gal","v":22300},10.115109859482438,{"$f":"[6]!FuelOil2_Boiler_lbsCH4_1000gal","v":5.1999999999999998E-2},{"$f":"IF(L38=\"\",\"\",IF($D38=\"\",L38,IF($D38=\"CO2e\",L38,L38*HLOOKUP($E38,'Reference Tables'!$F$85:$I$105,4,FALSE))))","v":1.0919999999999999},{"$f":"IFERROR(IF(M38=\"\",\"\",M38*$I38),\"\")","v":4.9532286845537312E-4},{"$f":"[6]!FuelOil2_Boiler_lbsN2O_1000gal","v":0.11},{"$f":"IF(O38=\"\",\"\",IF($D38=\"\",O38,IF($D38=\"CO2e\",O38,O38*HLOOKUP($E38,'Reference Tables'!$F$85:$I$105,5,FALSE))))","v":34.1},{"$f":"IFERROR(IF(P38=\"\",\"\",P38*$I38),\"\")","v":1.5467499829970904E-2},null,null,null,null,null,null,null,null,null,null,"",null,null,null,null,null,null,null,null,null,null,null,null,null,null,null,null,null,null,null,null,null,null,null,null,null,null,null,null,null,null,null,null,null,null,null,null,null,null,"",null,""]
[null,"Water generators emission factor","EF_fuel oil water generators","GHG","2AR","lb",{"$f":"IF(F39=\"\",\"\",\"/\")","v":"/"},"MMBtu",{"$f":"IFERROR(IF(F39=\"\",\"\",VLOOKUP(F39,'Reference Tables'!$D$137:$G$142,4,FALSE)),\"\")","v":4.5359237038037839E-4},{"$f":"[6]!FuelOil2_Generator_lbsCO2_MMBtu","v":165},7.4842741112762429E-2,null,null,null,null,null,null,null,null,null,null,null,null,null,null,null,null,"",null,null,null,null,null,null,null,null,null,null,null,null,null,null,null,null,null,null,null,null,null,null,null,null,null,null,null,null,null,null,null,null,null,null,null,null,null,null,"",null,""]
[null,null,null,null,null,null,null,null,null,null,null,null,null,null,null,null,null,null,null,null,null,null,null,null,null,null,null,{"$f":"IF(AA40=\"\",\"\",IF($D40=\"\",AA40,IF($D40=\"CO2e\",AA40,AA40*HLOOKUP($E40,'Reference Tables'!$F$85:$I$105,10,FALSE))))","v":""},"",null,{"$f":"IF(AD40=\"\",\"\",IF($D40=\"\",AD40,IF($D40=\"CO2e\",AD40,AD40*HLOOKUP($E40,'Reference Tables'!$F$85:$I$105,11,FALSE))))","v":""},"",null,{"$f":"IF(AG40=\"\",\"\",IF($D40=\"\",AG40,IF($D40=\"CO2e\",AG40,AG40*HLOOKUP($E40,'Reference Tables'!$F$85:$I$105,12,FALSE))))","v":""},"",null,{"$f":"IF(AJ40=\"\",\"\",IF($D40=\"\",AJ40,IF($D40=\"CO2e\",AJ40,AJ40*HLOOKUP($E40,'Reference Tables'!$F$85:$I$105,13,FALSE))))","v":""},"",null,{"$f":"IF(AM40=\"\",\"\",IF($D40=\"\",AM40,IF($D40=\"CO2e\",AM40,AM40*HLOOKUP($E40,'Reference Tables'!$F$85:$I$105,14,FALSE))))","v":""},"",null,{"$f":"IF(AP40=\"\",\"\",IF($D40=\"\",AP40,IF($D40=\"CO2e\",AP40,AP40*HLOOKUP($E40,'Reference Tables'!$F$85:$I$105,15,FALSE))))","v":""},"",null,{"$f":"IF(AS40=\"\",\"\",IF($D40=\"\",AS40,IF($D40=\"CO2e\",AS40,AS40*HLOOKUP($E40,'Reference Tables'!$F$85:$I$105,16,FALSE))))","v":""},"",null,{"$f":"IF(AV40=\"\",\"\",IF($D40=\"\",AV40,IF($D40=\"CO2e\",AV40,AV40*HLOOKUP($E40,'Reference Tables'!$F$85:$I$105,17,FALSE))))","v":""},"",null,{"$f":"IF(AY40=\"\",\"\",IF($D40=\"\",AY40,IF($D40=\"CO2e\",AY40,AY40*HLOOKUP($E40,'Reference Tables'!$F$85:$I$105,18,FALSE))))","v":""},"",null,{"$f":"IF(BB40=\"\",\"\",IF($D40=\"\",BB40,IF($D40=\"CO2e\",BB40,BB40*HLOOKUP($E40,'Reference Tables'!$F$85:$I$105,19,FALSE))))","v":""},"",null,{"$f":"IF(BE40=\"\",\"\",IF($D40=\"\",BE40,IF($D40=\"CO2e\",BE40,BE40*HLOOKUP($E40,'Reference Tables'!$F$85:$I$105,20,FALSE))))","v":""},"",null,{"$f":"IF(BH40=\"\",\"\",IF($D40=\"\",BH40,IF($D40=\"CO2e\",BH40,BH40*HLOOKUP($E40,'Reference Tables'!$F$85:$I$105,6,FALSE))))","v":""},"",null,{"$f":"IF(BK40=\"\",\"\",IF($D40=\"\",BK40,IF($D40=\"CO2e\",BK40,BK40*HLOOKUP($E40,'Reference Tables'!$F$85:$I$105,6,FALSE))))","v":""},"",null,{"$f":"IFERROR(IF(BN40=\"\",\"\",BN40*$I40),\"\")","v":""},null,""]
[]
[null,"VII. MACRO"]

{"sheet":"I - Stationary","index":5,"n_rows":121,"n_cols":35,"rows_kept":121,"cut":false,"hidden":false,"merged":[[23,1,24,1],[23,2,24,2],[23,5,24,5],[23,6,23,7],[23,25,23,29],[23,30,23,31],[23,32,24,32],[7,1,8,1],[7,2,8,2],[7,5,8,5],[7,6,7,7],[7,3,7,4],[7,25,7,29],[23,8,23,10],[23,3,23,4],[7,20,7,24],[7,13,7,18],[7,12,8,12],[23,19,24,19],[61,1,62,1],[61,2,62,2],[61,5,62,5],[61,6,61,7],[61,25,61,29],[61,30,61,31],[61,32,62,32],[46,1,47,1],[46,2,47,2],[46,5,47,5],[46,6,46,7],[46,3,46,4],[46,25,46,29],[46,30,46,31],[61,3,61,4],[61,19,62,19],[92,1,93,1],[92,2,93,2],[92,5,93,5],[92,6,92,7],[92,25,92,29],[92,12,93,12],[78,1,79,1],[78,2,79,2],[78,5,79,5],[78,6,78,7],[78,3,78,4],[78,25,78,29],[78,11,79,11],[92,11,93,11],[92,3,92,4],[78,8,78,10],[92,8,92,10],[78,12,79,12],[78,19,79,19],[92,19,93,19],[78,13,78,18],[78,20,78,24],[92,13,92,18],[92,20,92,24],[114,1,115,1],[114,2,115,2],[114,5,115,5],[114,6,114,7],[114,25,114,29],[114,30,114,31],[114,32,115,32],[106,1,107,1],[106,2,107,2],[106,5,107,5],[106,6,106,7],[106,3,106,4],[106,8,106,10],[114,3,114,4],[106,11,107,11],[114,11,115,11],[114,8,114,10],[106,12,107,12],[114,12,115,12],[106,25,106,29],[106,30,106,31],[106,32,107,32],[106,19,107,19],[114,19,115,19],[114,34,115,34],[7,34,8,34],[23,34,24,34],[46,34,47,34],[61,34,62,34],[78,34,79,34],[92,33,93,33],[106,33,107,33],[114,33,115,33],[7,33,8,33],[23,33,24,33],[46,33,47,33],[61,33,62,33],[78,33,79,33],[3,6,4,7],[1,6,1,7],[92,34,93,34],[106,34,107,34],[92,32,93,32],[46,8,46,10],[61,8,61,10],[61,12,62,12],[7,30,7,31],[46,32,47,32],[7,8,7,10],[61,11,62,11],[7,11,8,11],[23,11,24,11],[46,11,47,11],[23,12,24,12],[46,12,47,12],[78,30,78,31],[78,32,79,32],[1,33,1,34],[3,33,4,34],[92,30,92,31],[7,32,8,32],[46,19,47,19],[106,13,106,18],[106,20,106,24],[114,13,114,18],[114,20,114,24],[3,12,4,12],[3,19,4,19],[7,19,8,19],[23,13,23,18],[23,20,23,24],[46,13,46,18],[46,20,46,24],[61,13,61,18],[61,20,61,24]]}
[]
[null,"I STATIONARY ENERGY",null,null,null,null,"",null,null,null,null,null,"",null,null,null,null,null,null,"",null,null,null,null,null,null,null,null,null,null,null,null,null,""]
[]
[null,"Use this tab to record activity and emissions data for Stationary energy sources. Emission factors should be recorded in the 'Emission factors' tab.",null,null,null,null,"Convert activity data units",null,null,null,null,null,"View emission factor(s)",null,null,null,null,null,null,"Enter emissions data",null,null,null,null,null,null,null,null,null,null,null,null,null,"Data quality explanation (optional)"]
[]
[null,"I.1 RESIDENTIAL BUILDINGS"]
[]
[null,"GPC ref No.","Scope","GHG Emissions Source",null,"Notation \nkeys","Activity data",null,"Activity data multiplier",null,null,"Gas(es)","Emission factor","Emission factor",null,null,null,null,null,"Emissions data","GHGs (metric tonnes CO2e)",null,null,null,null,"GHGs (metric tonnes CO2e)",null,null,null,null,"Data Quality",null,"Description of method(s) used or explanation for using notation key(s)","Source","Data quality explanation (optional)"]
[null,null,null,"Activity","Description",null,"Amount","Units","From","To","Factor",null,null,"Units","CO2","CH4","N2O","Total tCO2e","CO2(b)",null,"CO2","CH4","N2O","Total tCO2e","CO2(b)","CO2","CH4","N2O","Total tCO2e","CO2(b)","AD","EF"]
[null,"I.1.1",1,"Emissions from fuel combustion within the city boundary"]
[null,"I.1.1",1,"Gas (natural gas)","Residential - Single Family - Peoples",null,{"$f":"[2]SUMMARY!$B$41","v":348144141.71000004},"therms",null,null,null,"CO2, CH4, N2O","EF_natural gas Peoples",{"$f":"IFERROR(CONCATENATE(\"tCO2e/\",VLOOKUP($M11,'Emission factors'!$C:$H,6,FALSE)),\"\")","v":"tCO2e/therm"},{"$f":"IFERROR(VLOOKUP($M11,'Emission factors'!$C:$BQ,9,FALSE),\"\")","v":5.4920337870651694E-3},{"$f":"IFERROR(VLOOKUP($M11,'Emission factors'!$C:$BQ,12,FALSE),\"\")","v":1.97440102951291E-4},{"$f":"IFERROR(VLOOKUP($M11,'Emission factors'!$C:$BQ,15,FALSE),\"\")","v":3.0992598591280001E-6},{"$f":"IFERROR(VLOOKUP($M11,'Emission factors'!$C:$BQ,65,FALSE),\"\")","v":""},{"$f":"IFERROR(VLOOKUP($M11,'Emission factors'!$C:$BQ,67,FALSE),\"\")","v":""},null,null,null,null,null,null,{"$f":"IFERROR(IF(AND($M11=\"\",$T11=\"\"),\"\",IF($M11=\"\",IF(U11=0,\"-\",U11),IF(O11=0,\"0\",$G11*IF($K11=\"\",1,$K11)*O11))),\"-\")","v":1912019.3890401246},68737.61518111125,1078.9891635923732,{"$f":"IFERROR(IF(AND($M11=\"\",$T11=\"\"),\"\",IF($M11=\"\",IF(X11=\"\",SUM(U11:W11),IF(X11=0,\"0\",X11)),IF($R11=\"\",SUM($Z11:$AB11),IF($R11=0,\"0\",$G11*IF($K11=\"\",1,$K11)*$R11)))),\"-\")","v":1981835.9933848283},{"$f":"IFERROR(IF(AND($M11=\"\",$T11=\"\"),\"\",IF($M11=\"\",IF(Y11=0,\"-\",Y11),IF(S11=0,\"0\",$G11*IF($K11=\"\",1,$K11)*S11))),\"-\")","v":"-"}]
[null,"I.1.1",1,"Gas (natural gas)","Residential - Multi Family - Peoples",null,{"$f":"[2]SUMMARY!$B$42","v":649917471.28999984},"therms",null,null,null,"CO2, CH4, N2O","EF_natural gas Peoples",{"$f":"IFERROR(CONCATENATE(\"tCO2e/\",VLOOKUP($M12,'Emission factors'!$C:$H,6,FALSE)),\"\")","v":"tCO2e/therm"},{"$f":"IFERROR(VLOOKUP($M12,'Emission factors'!$C:$BQ,9,FALSE),\"\")","v":5.4920337870651694E-3},{"$f":"IFERROR(VLOOKUP($M12,'Emission factors'!$C:$BQ,12,FALSE),\"\")","v":1.97440102951291E-4},{"$f":"IFERROR(VLOOKUP($M12,'Emission factors'!$C:$BQ,15,FALSE),\"\")","v":3.0992598591280001E-6},{"$f":"IFERROR(VLOOKUP($M12,'Emission factors'!$C:$BQ,65,FALSE),\"\")","v":""},{"$f":"IFERROR(VLOOKUP($M12,'Emission factors'!$C:$BQ,67,FALSE),\"\")","v":""},null,null,null,null,null,null,3569368.7111286363,128319.77244134028,2014.263130515071,{"$f":"IFERROR(IF(AND($M12=\"\",$T12=\"\"),\"\",IF($M12=\"\",IF(X12=\"\",SUM(U12:W12),IF(X12=0,\"0\",X12)),IF($R12=\"\",SUM($Z12:$AB12),IF($R12=0,\"0\",$G12*IF($K12=\"\",1,$K12)*$R12)))),\"-\")","v":3699702.7467004913},{"$f":"IFERROR(IF(AND($M12=\"\",$T12=\"\"),\"\",IF($M12=\"\",IF(Y12=0,\"-\",Y12),IF(S12=0,\"0\",$G12*IF($K12=\"\",1,$K12)*S12))),\"-\")","v":"-"}]
[null,"I.1.1",1,"Motor gasoline (petrol)","Residential lawn and garden equipment",null,null,null,null,null,null,null,null,{"$f":"IFERROR(CONCATENATE(\"tCO2e/\",VLOOKUP($M13,'Emission factors'!$C:$H,6,FALSE)),\"\")","v":""},{"$f":"IFERROR(VLOOKUP($M13,'Emission factors'!$C:$BQ,9,FALSE),\"\")","v":""},{"$f":"IFERROR(VLOOKUP($M13,'Emission factors'!$C:$BQ,12,FALSE),\"\")","v":""},{"$f":"IFERROR(VLOOKUP($M13,'Emission factors'!$C:$BQ,15,FALSE),\"\")","v":""},{"$f":"IFERROR(VLOOKUP($M13,'Emission factors'!$C:$BQ,65,FALSE),\"\")","v":""},{"$f":"IFERROR(VLOOKUP($M13,'Emission factors'!$C:$BQ,67,FALSE),\"\")","v":""},"✓",null,null,null,{"$f":"'[4]NONROAD Summary totals'!$I$77","v":33669.168598395459},null,{"$f":"IFERROR(IF(AND($M13=\"\",$T13=\"\"),\"\",IF($M13=\"\",IF(U13=0,\"-\",U13),IF(O13=0,\"0\",$G13*IF($K13=\"\",1,$K13)*O13))),\"-\")","v":"-"},"-","-",{"$f":"IFERROR(IF(AND($M13=\"\",$T13=\"\"),\"\",IF($M13=\"\",IF(X13=\"\",SUM(U13:W13),IF(X13=0,\"0\",X13)),IF($R13=\"\",SUM($Z13:$AB13),IF($R13=0,\"0\",$G13*IF($K13=\"\",1,$K13)*$R13)))),\"-\")","v":33669.168598395459},{"$f":"IFERROR(IF(AND($M13=\"\",$T13=\"\"),\"\",IF($M13=\"\",IF(Y13=0,\"-\",Y13),IF(S13=0,\"0\",$G13*IF($K13=\"\",1,$K13)*S13))),\"-\")","v":"-"}]
[null,"I.1.1",1,null,null,null,null,null,null,null,null,null,null,{"$f":"IFERROR(CONCATENATE(\"tCO2e/\",VLOOKUP($M14,'Emission factors'!$C:$H,6,FALSE)),\"\")","v":""},{"$f":"IFERROR(VLOOKUP($M14,'Emission factors'!$C:$BQ,9,FALSE),\"\")","v":""},{"$f":"IFERROR(VLOOKUP($M14,'Emission factors'!$C:$BQ,12,FALSE),\"\")","v":""},{"$f":"IFERROR(VLOOKUP($M14,'Emission factors'!$C:$BQ,15,FALSE),\"\")","v":""},{"$f":"IFERROR(VLOOKUP($M14,'Emission factors'!$C:$BQ,65,FALSE),\"\")","v":""},{"$f":"IFERROR(VLOOKUP($M14,'Emission factors'!$C:$BQ,67,FALSE),\"\")","v":""},null,null,null,null,null,null,"","","",{"$f":"IFERROR(IF(AND($M14=\"\",$T14=\"\"),\"\",IF($M14=\"\",IF(X14=\"\",SUM(U14:W14),IF(X14=0,\"0\",X14)),IF($R14=\"\",SUM($Z14:$AB14),IF($R14=0,\"0\",$G14*IF($K14=\"\",1,$K14)*$R14)))),\"-\")","v":""},{"$f":"IFERROR(IF(AND($M14=\"\",$T14=\"\"),\"\",IF($M14=\"\",IF(Y14=0,\"-\",Y14),IF(S14=0,\"0\",$G14*IF($K14=\"\",1,$K14)*S14))),\"-\")","v":""}]
[null,"I.1.2",2,"Emissions from grid-supplied energy consumed within the city boundary"]
[null,"I.1.2",2,"Electricity","Residential - Single Family",null,{"$f":"[2]SUMMARY!$B$10","v":3485133887.5342007},"kWh","kWh","MWh",1E-3,"CO2, CH4, N2O","EF_electricity",{"$f":"IFERROR(CONCATENATE(\"tCO2e/\",VLOOKUP($M16,'Emission factors'!$C:$H,6,FALSE)),\"\")","v":"tCO2e/MWh"},{"$f":"IFERROR(VLOOKUP($M16,'Emission factors'!$C:$BQ,9,FALSE),\"\")","v":0.61334216968608457},{"$f":"IFERROR(VLOOKUP($M16,'Emission factors'!$C:$BQ,12,FALSE),\"\")","v":1.9967155748245008E-4},{"$f":"IFERROR(VLOOKUP($M16,'Emission factors'!$C:$BQ,15,FALSE),\"\")","v":3.1549889881123346E-3},{"$f":"IFERROR(VLOOKUP($M16,'Emission factors'!$C:$BQ,65,FALSE),\"\")","v":""},{"$f":"IFERROR(VLOOKUP($M16,'Emission factors'!$C:$BQ,67,FALSE),\"\")","v":""},null,null,null,null,null,null,{"$f":"IFERROR(IF(AND($M16=\"\",$T16=\"\"),\"\",IF($M16=\"\",IF(U16=0,\"-\",U16),IF(O16=0,\"0\",$G16*IF($K16=\"\",1,$K16)*O16))),\"-\")","v":2137579.5802267254},695.88211135881988,10995.559037267534,{"$f":"IFERROR(IF(AND($M16=\"\",$T16=\"\"),\"\",IF($M16=\"\",IF(X16=\"\",SUM(U16:W16),IF(X16=0,\"0\",X16)),IF($R16=\"\",SUM($Z16:$AB16),IF($R16=0,\"0\",$G16*IF($K16=\"\",1,$K16)*$R16)))),\"-\")","v":2149271.0213753521},{"$f":"IFERROR(IF(AND($M16=\"\",$T16=\"\"),\"\",IF($M16=\"\",IF(Y16=0,\"-\",Y16),IF(S16=0,\"0\",$G16*IF($K16=\"\",1,$K16)*S16))),\"-\")","v":"-"}]
[null,"I.1.2",2,"Electricity","Residential - Multi Family",null,{"$f":"[2]SUMMARY!$B$11","v":3102760690.3935003},"kWh","kWh","MWh",1E-3,"CO2, CH4, N2O","EF_electricity",{"$f":"IFERROR(CONCATENATE(\"tCO2e/\",VLOOKUP($M17,'Emission factors'!$C:$H,6,FALSE)),\"\")","v":"tCO2e/MWh"},{"$f":"IFERROR(VLOOKUP($M17,'Emission factors'!$C:$BQ,9,FALSE),\"\")","v":0.61334216968608457},{"$f":"IFERROR(VLOOKUP($M17,'Emission factors'!$C:$BQ,12,FALSE),\"\")","v":1.9967155748245008E-4},{"$f":"IFERROR(VLOOKUP($M17,'Emission factors'!$C:$BQ,15,FALSE),\"\")","v":3.1549889881123346E-3},{"$f":"IFERROR(VLOOKUP($M17,'Emission factors'!$C:$BQ,65,FALSE),\"\")","v":""},{"$f":"IFERROR(VLOOKUP($M17,'Emission factors'!$C:$BQ,67,FALSE),\"\")","v":""},null,null,null,null,null,null,1903053.9738626434,619.53305954619236,9789.1758109393195,{"$f":"IFERROR(IF(AND($M17=\"\",$T17=\"\"),\"\",IF($M17=\"\",IF(X17=\"\",SUM(U17:W17),IF(X17=0,\"0\",X17)),IF($R17=\"\",SUM($Z17:$AB17),IF($R17=0,\"0\",$G17*IF($K17=\"\",1,$K17)*$R17)))),\"-\")","v":1913462.682733129},{"$f":"IFERROR(IF(AND($M17=\"\",$T17=\"\"),\"\",IF($M17=\"\",IF(Y17=0,\"-\",Y17),IF(S17=0,\"0\",$G17*IF($K17=\"\",1,$K17)*S17))),\"-\")","v":"-"}]
[null,"I.1.3",3,"Transmission and distribution losses from grid-supplied energy",null,"NE"]
[null,"I.1.3",3,null,null,null,null,null,null,null,null,null,null,{"$f":"IFERROR(CONCATENATE(\"tCO2e/\",VLOOKUP($M19,'Emission factors'!$C:$H,6,FALSE)),\"\")","v":""},{"$f":"IFERROR(VLOOKUP($M19,'Emission factors'!$C:$BQ,9,FALSE),\"\")","v":""},{"$f":"IFERROR(VLOOKUP($M19,'Emission factors'!$C:$BQ,12,FALSE),\"\")","v":""},{"$f":"IFERROR(VLOOKUP($M19,'Emission factors'!$C:$BQ,15,FALSE),\"\")","v":""},{"$f":"IFERROR(VLOOKUP($M19,'Emission factors'!$C:$BQ,65,FALSE),\"\")","v":""},{"$f":"IFERROR(VLOOKUP($M19,'Emission factors'!$C:$BQ,67,FALSE),\"\")","v":""},null,null,null,null,null,null,{"$f":"IFERROR(IF(AND($M19=\"\",$T19=\"\"),\"\",IF($M19=\"\",IF(U19=0,\"-\",U19),IF(O19=0,\"0\",$G19*IF($K19=\"\",1,$K19)*O19))),\"-\")","v":""},"","",{"$f":"IFERROR(IF(AND($M19=\"\",$T19=\"\"),\"\",IF($M19=\"\",IF(X19=\"\",SUM(U19:W19),IF(X19=0,\"0\",X19)),IF($R19=\"\",SUM($Z19:$AB19),IF($R19=0,\"0\",$G19*IF($K19=\"\",1,$K19)*$R19)))),\"-\")","v":""},{"$f":"IFERROR(IF(AND($M19=\"\",$T19=\"\"),\"\",IF($M19=\"\",IF(Y19=0,\"-\",Y19),IF(S19=0,\"0\",$G19*IF($K19=\"\",1,$K19)*S19))),\"-\")","v":""}]
[null,"I.1.3",3,null,null,null,null,null,null,null,null,null,null,{"$f":"IFERROR(CONCATENATE(\"tCO2e/\",VLOOKUP($M20,'Emission factors'!$C:$H,6,FALSE)),\"\")","v":""},{"$f":"IFERROR(VLOOKUP($M20,'Emission factors'!$C:$BQ,9,FALSE),\"\")","v":""},{"$f":"IFERROR(VLOOKUP($M20,'Emission factors'!$C:$BQ,12,FALSE),\"\")","v":""},{"$f":"IFERROR(VLOOKUP($M20,'Emission factors'!$C:$BQ,15,FALSE),\"\")","v":""},{"$f":"IFERROR(VLOOKUP($M20,'Emission factors'!$C:$BQ,65,FALSE),\"\")","v":""},{"$f":"IFERROR(VLOOKUP($M20,'Emission factors'!$C:$BQ,67,FALSE),\"\")","v":""},null,null,null,null,null,null,"","","",{"$f":"IFERROR(IF(AND($M20=\"\",$T20=\"\"),\"\",IF($M20=\"\",IF(X20=\"\",SUM(U20:W20),IF(X20=0,\"0\",X20)),IF($R20=\"\",SUM($Z20:$AB20),IF($R20=0,\"0\",$G20*IF($K20=\"\",1,$K20)*$R20)))),\"-\")","v":""},{"$f":"IFERROR(IF(AND($M20=\"\",$T20=\"\"),\"\",IF($M20=\"\",IF(Y20=0,\"-\",Y20),IF(S20=0,\"0\",$G20*IF($K20=\"\",1,$K20)*S20))),\"-\")","v":""}]
[]
[null,"I.2 COMMERCIAL AND INSTITUTIONAL BUILDINGS AND FACILITIES"]
[]
[null,"GPC ref No.","Scope","GHG Emissions Source",null,"Notation \nkeys","Activity data",null,"Activity data multiplier",null,null,"Gas(es)","Emission factor","Emission factor",null,null,null,null,null,"Emissions data","GHGs (metric tonnes CO2e)",null,null,null,null,"GHGs (metric tonnes CO2e)",null,null,null,null,"Data Quality",null,"Description of method(s) used or explanation for using notation key(s)","Source","Data quality explanation (optional)"]
[null,null,null,"Activity","Description",null,"Amount","Units","From","To","Factor",null,null,"Units","CO2","CH4","N2O","Total tCO2e","CO2(b)",null,"CO2","CH4","N2O","Total tCO2e","CO2(b)","CO2","CH4","N2O","Total tCO2e","CO2(b)","AD","EF"]
[null,"I.2.1",1,"Emissions from fuel combustion within the city boundary"]
[null,"I.2.1",1,"Gas (natural gas)","Commercial - Peoples",null,{"$f":"[2]SUMMARY!$B$43","v":337942280.20999998},"therms",null,null,null,"CO2, CH4, N2O","EF_natural gas Peoples",{"$f":"IFERROR(CONCATENATE(\"tCO2e/\",VLOOKUP($M27,'Emission factors'!$C:$H,6,FALSE)),\"\")","v":"tCO2e/therm"},{"$f":"IFERROR(VLOOKUP($M27,'Emission factors'!$C:$BQ,9,FALSE),\"\")","v":5.4920337870651694E-3},{"$f":"IFERROR(VLOOKUP($M27,'Emission factors'!$C:$BQ,12,FALSE),\"\")","v":1.97440102951291E-4},{"$f":"IFERROR(VLOOKUP($M27,'Emission factors'!$C:$BQ,15,FALSE),\"\")","v":3.0992598591280001E-6},{"$f":"IFERROR(VLOOKUP($M27,'Emission factors'!$C:$BQ,65,FALSE),\"\")","v":""},{"$f":"IFERROR(VLOOKUP($M27,'Emission factors'!$C:$BQ,67,FALSE),\"\")","v":""},null,null,null,null,null,null,{"$f":"IFERROR(IF(AND($M27=\"\",$T27=\"\"),\"\",IF($M27=\"\",IF(U27=0,\"-\",U27),IF(O27=0,\"0\",$G27*IF($K27=\"\",1,$K27)*O27))),\"-\")","v":1855990.4209911649},66723.358596256425,1047.3709437570396,{"$f":"IFERROR(IF(AND($M27=\"\",$T27=\"\"),\"\",IF($M27=\"\",IF(X27=\"\",SUM(U27:W27),IF(X27=0,\"0\",X27)),IF($R27=\"\",SUM($Z27:$AB27),IF($R27=0,\"0\",$G27*IF($K27=\"\",1,$K27)*$R27)))),\"-\")","v":1923761.1505311783},{"$f":"IFERROR(IF(AND($M27=\"\",$T27=\"\"),\"\",IF($M27=\"\",IF(Y27=0,\"-\",Y27),IF(S27=0,\"0\",$G27*IF($K27=\"\",1,$K27)*S27))),\"-\")","v":"-"}]
[null,"I.2.1",1,"Gas (natural gas)","Municipal - Peoples",null,{"$f":"[2]SUMMARY!$B$48","v":146918791.36999997},"therms",null,null,null,"CO2, CH4, N2O","EF_natural gas Peoples",{"$f":"IFERROR(CONCATENATE(\"tCO2e/\",VLOOKUP($M28,'Emission factors'!$C:$H,6,FALSE)),\"\")","v":"tCO2e/therm"},{"$f":"IFERROR(VLOOKUP($M28,'Emission factors'!$C:$BQ,9,FALSE),\"\")","v":5.4920337870651694E-3},{"$f":"IFERROR(VLOOKUP($M28,'Emission factors'!$C:$BQ,12,FALSE),\"\")","v":1.97440102951291E-4},{"$f":"IFERROR(VLOOKUP($M28,'Emission factors'!$C:$BQ,15,FALSE),\"\")","v":3.0992598591280001E-6},{"$f":"IFERROR(VLOOKUP($M28,'Emission factors'!$C:$BQ,65,FALSE),\"\")","v":""},{"$f":"IFERROR(VLOOKUP($M28,'Emission factors'!$C:$BQ,67,FALSE),\"\")","v":""},null,null,null,null,null,null,806882.96615881845,{"$f":"IFERROR(IF(AND($M28=\"\",$T28=\"\"),\"\",IF($M28=\"\",IF(V28=0,\"-\",V28),IF(P28=0,\"0\",$G28*IF($K28=\"\",1,$K28)*P28))),\"-\")","v":29007.66129357204},{"$f":"IFERROR(IF(AND($M28=\"\",$T28=\"\"),\"\",IF($M28=\"\",IF(W28=0,\"-\",W28),IF(Q28=0,\"0\",$G28*IF($K28=\"\",1,$K28)*Q28))),\"-\")","v":455.33951264464218},836345.96696503519,"-"]
[null,"I.2.1",1,"Gas (natural gas)","Unspecifiied - Peoples",null,{"$f":"[2]SUMMARY!$B$49","v":4530.7300000000005},"therms",null,null,null,"CO2, CH4, N2O","EF_natural gas Peoples",{"$f":"IFERROR(CONCATENATE(\"tCO2e/\",VLOOKUP($M29,'Emission factors'!$C:$H,6,FALSE)),\"\")","v":"tCO2e/therm"},{"$f":"IFERROR(VLOOKUP($M29,'Emission factors'!$C:$BQ,9,FALSE),\"\")","v":5.4920337870651694E-3},{"$f":"IFERROR(VLOOKUP($M29,'Emission factors'!$C:$BQ,12,FALSE),\"\")","v":1.97440102951291E-4},{"$f":"IFERROR(VLOOKUP($M29,'Emission factors'!$C:$BQ,15,FALSE),\"\")","v":3.0992598591280001E-6},{"$f":"IFERROR(VLOOKUP($M29,'Emission factors'!$C:$BQ,65,FALSE),\"\")","v":""},{"$f":"IFERROR(VLOOKUP($M29,'Emission factors'!$C:$BQ,67,FALSE),\"\")","v":""},null,null,null,null,null,null,{"$f":"IFERROR(IF(AND($M29=\"\",$T29=\"\"),\"\",IF($M29=\"\",IF(U29=0,\"-\",U29),IF(O29=0,\"0\",$G29*IF($K29=\"\",1,$K29)*O29))),\"-\")","v":24.882922240069778},0.89454779764450276,1.4041909621547005E-2,25.791511947335827,"-"]
[null,"I.2.1",1,"Motor gasoline (petrol)","Commercial equipment (offroad)",null,null,null,null,null,null,"CO2, CH4, N2O",null,{"$f":"IFERROR(CONCATENATE(\"tCO2e/\",VLOOKUP($M30,'Emission factors'!$C:$H,6,FALSE)),\"\")","v":""},{"$f":"IFERROR(VLOOKUP($M30,'Emission factors'!$C:$BQ,9,FALSE),\"\")","v":""},{"$f":"IFERROR(VLOOKUP($M30,'Emission factors'!$C:$BQ,12,FALSE),\"\")","v":""},{"$f":"IFERROR(VLOOKUP($M30,'Emission factors'!$C:$BQ,15,FALSE),\"\")","v":""},{"$f":"IFERROR(VLOOKUP($M30,'Emission factors'!$C:$BQ,65,FALSE),\"\")","v":""},{"$f":"IFERROR(VLOOKUP($M30,'Emission factors'!$C:$BQ,67,FALSE),\"\")","v":""},"✓",null,null,null,{"$f":"'[4]NONROAD Summary totals'!$I$21","v":115215.9369413862},null,"-","-","-",115215.9369413862,"-"]
[null,"I.2.1",1,"Motor gasoline (petrol)","Commercial lawn and garden equipment (offroad)",null,null,null,null,null,null,"CO2, CH4, N2O",null,{"$f":"IFERROR(CONCATENATE(\"tCO2e/\",VLOOKUP($M31,'Emission factors'!$C:$H,6,FALSE)),\"\")","v":""},{"$f":"IFERROR(VLOOKUP($M31,'Emission factors'!$C:$BQ,9,FALSE),\"\")","v":""},{"$f":"IFERROR(VLOOKUP($M31,'Emission factors'!$C:$BQ,12,FALSE),\"\")","v":""},{"$f":"IFERROR(VLOOKUP($M31,'Emission factors'!$C:$BQ,15,FALSE),\"\")","v":""},{"$f":"IFERROR(VLOOKUP($M31,'Emission factors'!$C:$BQ,65,FALSE),\"\")","v":""},{"$f":"IFERROR(VLOOKUP($M31,'Emission factors'!$C:$BQ,67,FALSE),\"\")","v":""},"✓",null,null,null,{"$f":"'[4]NONROAD Summary totals'!$I$69","v":38269.305004393158},null,{"$f":"IFERROR(IF(AND($M31=\"\",$T31=\"\"),\"\",IF($M31=\"\",IF(U31=0,\"-\",U31),IF(O31=0,\"0\",$G31*IF($K31=\"\",1,$K31)*O31))),\"-\")","v":"-"},"-","-",38269.305004393158,"-"]
[null,"I.2.1",1,"Gas (natural gas)","Wastewater treatment plant natural gas use",null,{"$f":"[5]Emissions!$B$20","v":1177503.3092834358},"therms","therms","MMBtu",9.9976124488000001E-2,"CO2, CH4, N2O","EF_natural gas_wastewater",{"$f":"IFERROR(CONCATENATE(\"tCO2e/\",VLOOKUP($M32,'Emission factors'!$C:$H,6,FALSE)),\"\")","v":"tCO2e/MMBtu"},{"$f":"IFERROR(VLOOKUP($M32,'Emission factors'!$C:$BQ,9,FALSE),\"\")","v":5.3020000000000005E-2},{"$f":"IFERROR(VLOOKUP($M32,'Emission factors'!$C:$BQ,12,FALSE),\"\")","v":2.1000000000000002E-5},{"$f":"IFERROR(VLOOKUP($M32,'Emission factors'!$C:$BQ,15,FALSE),\"\")","v":3.1000000000000001E-5},{"$f":"IFERROR(VLOOKUP($M32,'Emission factors'!$C:$BQ,65,FALSE),\"\")","v":""},{"$f":"IFERROR(VLOOKUP($M32,'Emission factors'!$C:$BQ,67,FALSE),\"\")","v":""},null,null,null,null,null,null,{"$f":"IFERROR(IF(AND($M32=\"\",$T32=\"\"),\"\",IF($M32=\"\",IF(U32=0,\"-\",U32),IF(O32=0,\"0\",$G32*IF($K32=\"\",1,$K32)*O32))),\"-\")","v":6241.6319683481752},2.4721665661130077,3.6493887404525349,{"$f":"IFERROR(IF(AND($M32=\"\",$T32=\"\"),\"\",IF($M32=\"\",IF(X32=\"\",SUM(U32:W32),IF(X32=0,\"0\",X32)),IF($R32=\"\",SUM($Z32:$AB32),IF($R32=0,\"0\",$G32*IF($K32=\"\",1,$K32)*$R32)))),\"-\")","v":6247.7535236547401},"-"]
[null,"I.2.1",1,"Gas (natural gas)","Water supply natural gas use",null,{"$f":"'[6]Summary - Energy Consumption'!$B$28","v":15182363.921613257},"therms","therms","10 cubic feet",9.2254858694247802E-5,"CO2, CH4, N2O","EF_natural gas water",{"$f":"IFERROR(CONCATENATE(\"tCO2e/\",VLOOKUP($M33,'Emission factors'!$C:$H,6,FALSE)),\"\")","v":"tCO2e/10 cubic feet"},{"$f":"IFERROR(VLOOKUP($M33,'Emission factors'!$C:$BQ,9,FALSE),\"\")","v":54.431084445645403},{"$f":"IFERROR(VLOOKUP($M33,'Emission factors'!$C:$BQ,12,FALSE),\"\")","v":2.1908511489372274E-2},{"$f":"IFERROR(VLOOKUP($M33,'Emission factors'!$C:$BQ,15,FALSE),\"\")","v":0.30934999659941809},{"$f":"IFERROR(VLOOKUP($M33,'Emission factors'!$C:$BQ,65,FALSE),\"\")","v":""},{"$f":"IFERROR(VLOOKUP($M33,'Emission factors'!$C:$BQ,67,FALSE),\"\")","v":""},null,null,null,null,null,null,76238.726330390855,30.686087347982316,{"$f":"IFERROR(IF(AND($M33=\"\",$T33=\"\"),\"\",IF($M33=\"\",IF(W33=0,\"-\",W33),IF(Q33=0,\"0\",$G33*IF($K33=\"\",1,$K33)*Q33))),\"-\")","v":433.29009464438809},{"$f":"IFERROR(IF(AND($M33=\"\",$T33=\"\"),\"\",IF($M33=\"\",IF(X33=\"\",SUM(U33:W33),IF(X33=0,\"0\",X33)),IF($R33=\"\",SUM($Z33:$AB33),IF($R33=0,\"0\",$G33*IF($K33=\"\",1,$K33)*$R33)))),\"-\")","v":76702.702512383228},{"$f":"IFERROR(IF(AND($M33=\"\",$T33=\"\"),\"\",IF($M33=\"\",IF(Y33=0,\"-\",Y33),IF(S33=0,\"0\",$G33*IF($K33=\"\",1,$K33)*S33))),\"-\")","v":"-"}]
[null,"I.2.1",1,"Diesel oil ","Water supply boilers",null,{"$f":"'[6]Summary - Energy Consumption'!$B$29","v":24432.052875811605},"gallons","gallons","1000 gallons",1E-3,"CO2, CH4, N2O","EF_fuel oil water boilers",{"$f":"IFERROR(CONCATENATE(\"tCO2e/\",VLOOKUP($M34,'Emission factors'!$C:$H,6,FALSE)),\"\")","v":"tCO2e/1000 gallons"},{"$f":"IFERROR(VLOOKUP($M34,'Emission factors'!$C:$BQ,9,FALSE),\"\")","v":10.115109859482438},{"$f":"IFERROR(VLOOKUP($M34,'Emission factors'!$C:$BQ,12,FALSE),\"\")","v":4.9532286845537312E-4},{"$f":"IFERROR(VLOOKUP($M34,'Emission factors'!$C:$BQ,15,FALSE),\"\")","v":1.5467499829970904E-2},{"$f":"IFERROR(VLOOKUP($M34,'Emission factors'!$C:$BQ,65,FALSE),\"\")","v":""},{"$f":"IFERROR(VLOOKUP($M34,'Emission factors'!$C:$BQ,67,FALSE),\"\")","v":""},null,null,null,null,null,null,247.13289893151824,1.2101754512700354E-2,{"$f":"IFERROR(IF(AND($M34=\"\",$T34=\"\"),\"\",IF($M34=\"\",IF(W34=0,\"-\",W34),IF(Q34=0,\"0\",$G34*IF($K34=\"\",1,$K34)*Q34))),\"-\")","v":0.37790277370245617},{"$f":"IFERROR(IF(AND($M34=\"\",$T34=\"\"),\"\",IF($M34=\"\",IF(X34=\"\",SUM(U34:W34),IF(X34=0,\"0\",X34)),IF($R34=\"\",SUM($Z34:$AB34),IF($R34=0,\"0\",$G34*IF($K34=\"\",1,$K34)*$R34)))),\"-\")","v":247.52290345973341},{"$f":"IFERROR(IF(AND($M34=\"\",$T34=\"\"),\"\",IF($M34=\"\",IF(Y34=0,\"-\",Y34),IF(S34=0,\"0\",$G34*IF($K34=\"\",1,$K34)*S34))),\"-\")","v":"-"}]
[null,"I.2.1",1,"Diesel oil ","Water supply generators",null,{"$f":"'[6]Summary - Energy Consumption'!$B$30","v":12693.363412478502},"gallons","gallons","MMBtu",0.14000000000000001,"CO2","EF_fuel oil water generators",{"$f":"IFERROR(CONCATENATE(\"tCO2e/\",VLOOKUP($M35,'Emission factors'!$C:$H,6,FALSE)),\"\")","v":"tCO2e/MMBtu"},{"$f":"IFERROR(VLOOKUP($M35,'Emission factors'!$C:$BQ,9,FALSE),\"\")","v":7.4842741112762429E-2},{"$f":"IFERROR(VLOOKUP($M35,'Emission factors'!$C:$BQ,12,FALSE),\"\")","v":0},{"$f":"IFERROR(VLOOKUP($M35,'Emission factors'!$C:$BQ,15,FALSE),\"\")","v":0},{"$f":"IFERROR(VLOOKUP($M35,'Emission factors'!$C:$BQ,65,FALSE),\"\")","v":""},{"$f":"IFERROR(VLOOKUP($M35,'Emission factors'!$C:$BQ,67,FALSE),\"\")","v":""},null,null,null,null,null,null,133.0008556422475,"0",{"$f":"IFERROR(IF(AND($M35=\"\",$T35=\"\"),\"\",IF($M35=\"\",IF(W35=0,\"-\",W35),IF(Q35=0,\"0\",$G35*IF($K35=\"\",1,$K35)*Q35))),\"-\")","v":"0"},{"$f":"IFERROR(IF(AND($M35=\"\",$T35=\"\"),\"\",IF($M35=\"\",IF(X35=\"\",SUM(U35:W35),IF(X35=0,\"0\",X35)),IF($R35=\"\",SUM($Z35:$AB35),IF($R35=0,\"0\",$G35*IF($K35=\"\",1,$K35)*$R35)))),\"-\")","v":133.0008556422475},{"$f":"IFERROR(IF(AND($M35=\"\",$T35=\"\"),\"\",IF($M35=\"\",IF(Y35=0,\"-\",Y35),IF(S35=0,\"0\",$G35*IF($K35=\"\",1,$K35)*S35))),\"-\")","v":"-"}]
[null,"I.2.1",1,null,null,null,null,null,null,null,null,null,null,{"$f":"IFERROR(CONCATENATE(\"tCO2e/\",VLOOKUP($M36,'Emission factors'!$C:$H,6,FALSE)),\"\")","v":""},{"$f":"IFERROR(VLOOKUP($M36,'Emission factors'!$C:$BQ,9,FALSE),\"\")","v":""},{"$f":"IFERROR(VLOOKUP($M36,'Emission factors'!$C:$BQ,12,FALSE),\"\")","v":""},{"$f":"IFERROR(VLOOKUP($M36,'Emission factors'!$C:$BQ,15,FALSE),\"\")","v":""},{"$f":"IFERROR(VLOOKUP($M36,'Emission factors'!$C:$BQ,65,FALSE),\"\")","v":""},{"$f":"IFERROR(VLOOKUP($M36,'Emission factors'!$C:$BQ,67,FALSE),\"\")","v":""},null,null,null,null,null,null,"","",{"$f":"IFERROR(IF(AND($M36=\"\",$T36=\"\"),\"\",IF($M36=\"\",IF(W36=0,\"-\",W36),IF(Q36=0,\"0\",$G36*IF($K36=\"\",1,$K36)*Q36))),\"-\")","v":""},{"$f":"IFERROR(IF(AND($M36=\"\",$T36=\"\"),\"\",IF($M36=\"\",IF(X36=\"\",SUM(U36:W36),IF(X36=0,\"0\",X36)),IF($R36=\"\",SUM($Z36:$AB36),IF($R36=0,\"0\",$G36*IF($K36=\"\",1,$K36)*$R36)))),\"-\")","v":""},{"$f":"IFERROR(IF(AND($M36=\"\",$T36=\"\"),\"\",IF($M36=\"\",IF(Y36=0,\"-\",Y36),IF(S36=0,\"0\",$G36*IF($K36=\"\",1,$K36)*S36))),\"-\")","v":""}]
[null,"I.2.2",2,"Emissions from grid-supplied energy consumed within the city boundary"]
[null,"I.2.2",2,"Electricity","Commercial and Industrial buildings",null,{"$f":"[2]SUMMARY!$B$16","v":17066360331.373699},"kWh","kWh","MWh",1E-3,"CO2, CH4, N2O","EF_electricity",{"$f":"IFERROR(CONCATENATE(\"tCO2e/\",VLOOKUP($M38,'Emission factors'!$C:$H,6,FALSE)),\"\")","v":"tCO2e/MWh"},{"$f":"IFERROR(VLOOKUP($M38,'Emission factors'!$C:$BQ,9,FALSE),\"\")","v":0.61334216968608457},{"$f":"IFERROR(VLOOKUP($M38,'Emission factors'!$C:$BQ,12,FALSE),\"\")","v":1.9967155748245008E-4},{"$f":"IFERROR(VLOOKUP($M38,'Emission factors'!$C:$BQ,15,FALSE),\"\")","v":3.1549889881123346E-3},{"$f":"IFERROR(VLOOKUP($M38,'Emission factors'!$C:$BQ,65,FALSE),\"\")","v":""},{"$f":"IFERROR(VLOOKUP($M38,'Emission factors'!$C:$BQ,67,FALSE),\"\")","v":""},null,null,null,null,null,null,{"$f":"IFERROR(IF(AND($M38=\"\",$T38=\"\"),\"\",IF($M38=\"\",IF(U38=0,\"-\",U38),IF(O38=0,\"0\",$G38*IF($K38=\"\",1,$K38)*O38))),\"-\")","v":10467518.47428927},3407.6667479220891,53844.178912641197,{"$f":"IFERROR(IF(AND($M38=\"\",$T38=\"\"),\"\",IF($M38=\"\",IF(X38=\"\",SUM(U38:W38),IF(X38=0,\"0\",X38)),IF($R38=\"\",SUM($Z38:$AB38),IF($R38=0,\"0\",$G38*IF($K38=\"\",1,$K38)*$R38)))),\"-\")","v":10524770.319949834},{"$f":"IFERROR(IF(AND($M38=\"\",$T38=\"\"),\"\",IF($M38=\"\",IF(Y38=0,\"-\",Y38),IF(S38=0,\"0\",$G38*IF($K38=\"\",1,$K38)*S38))),\"-\")","v":"-"}]
[null,"I.2.2",2,"Electricity","Wastewater treatment plant electricity use",null,{"$f":"[5]Emissions!$B$18","v":266643119.11319473},"kWh","kWh","MWh",1E-3,"CO2, CH4, N2O","EF_electricity",{"$f":"IFERROR(CONCATENATE(\"tCO2e/\",VLOOKUP($M39,'Emission factors'!$C:$H,6,FALSE)),\"\")","v":"tCO2e/MWh"},{"$f":"IFERROR(VLOOKUP($M39,'Emission factors'!$C:$BQ,9,FALSE),\"\")","v":0.61334216968608457},{"$f":"IFERROR(VLOOKUP($M39,'Emission factors'!$C:$BQ,12,FALSE),\"\")","v":1.9967155748245008E-4},{"$f":"IFERROR(VLOOKUP($M39,'Emission factors'!$C:$BQ,15,FALSE),\"\")","v":3.1549889881123346E-3},{"$f":"IFERROR(VLOOKUP($M39,'Emission factors'!$C:$BQ,65,FALSE),\"\")","v":""},{"$f":"IFERROR(VLOOKUP($M39,'Emission factors'!$C:$BQ,67,FALSE),\"\")","v":""},null,null,null,null,null,null,163543.46920875195,53.241046885310048,841.25610455805509,{"$f":"IFERROR(IF(AND($M39=\"\",$T39=\"\"),\"\",IF($M39=\"\",IF(X39=\"\",SUM(U39:W39),IF(X39=0,\"0\",X39)),IF($R39=\"\",SUM($Z39:$AB39),IF($R39=0,\"0\",$G39*IF($K39=\"\",1,$K39)*$R39)))),\"-\")","v":164437.96636019534},{"$f":"IFERROR(IF(AND($M39=\"\",$T39=\"\"),\"\",IF($M39=\"\",IF(Y39=0,\"-\",Y39),IF(S39=0,\"0\",$G39*IF($K39=\"\",1,$K39)*S39))),\"-\")","v":"-"}]
[null,"I.2.2",2,"Electricity","Water supply electricity use",null,{"$f":"'[6]Summary - Energy Consumption'!$B$27","v":94314192.771157503},"kWh","kWh","MWh",1E-3,"CO2, CH4, N2O","EF_electricity",{"$f":"IFERROR(CONCATENATE(\"tCO2e/\",VLOOKUP($M40,'Emission factors'!$C:$H,6,FALSE)),\"\")","v":"tCO2e/MWh"},{"$f":"IFERROR(VLOOKUP($M40,'Emission factors'!$C:$BQ,9,FALSE),\"\")","v":0.61334216968608457},{"$f":"IFERROR(VLOOKUP($M40,'Emission factors'!$C:$BQ,12,FALSE),\"\")","v":1.9967155748245008E-4},{"$f":"IFERROR(VLOOKUP($M40,'Emission factors'!$C:$BQ,15,FALSE),\"\")","v":3.1549889881123346E-3},{"$f":"IFERROR(VLOOKUP($M40,'Emission factors'!$C:$BQ,65,FALSE),\"\")","v":""},{"$f":"IFERROR(VLOOKUP($M40,'Emission factors'!$C:$BQ,67,FALSE),\"\")","v":""},null,null,null,null,null,null,{"$f":"IFERROR(IF(AND($M40=\"\",$T40=\"\"),\"\",IF($M40=\"\",IF(U40=0,\"-\",U40),IF(O40=0,\"0\",$G40*IF($K40=\"\",1,$K40)*O40))),\"-\")","v":57846.87162645338},{"$f":"IFERROR(IF(AND($M40=\"\",$T40=\"\"),\"\",IF($M40=\"\",IF(V40=0,\"-\",V40),IF(P40=0,\"0\",$G40*IF($K40=\"\",1,$K40)*P40))),\"-\")","v":18.831861763317054},{"$f":"IFERROR(IF(AND($M40=\"\",$T40=\"\"),\"\",IF($M40=\"\",IF(W40=0,\"-\",W40),IF(Q40=0,\"0\",$G40*IF($K40=\"\",1,$K40)*Q40))),\"-\")","v":297.56023961570588},{"$f":"IFERROR(IF(AND($M40=\"\",$T40=\"\"),\"\",IF($M40=\"\",IF(X40=\"\",SUM(U40:W40),IF(X40=0,\"0\",X40)),IF($R40=\"\",SUM($Z40:$AB40),IF($R40=0,\"0\",$G40*IF($K40=\"\",1,$K40)*$R40)))),\"-\")","v":58163.263727832404},{"$f":"IFERROR(IF(AND($M40=\"\",$T40=\"\"),\"\",IF($M40=\"\",IF(Y40=0,\"-\",Y40),IF(S40=0,\"0\",$G40*IF($K40=\"\",1,$K40)*S40))),\"-\")","v":"-"}]
[null,"I.2.3",3,"Transmission and distribution losses from grid-supplied energy",null,"NE"]
[null,"I.2.3",3,null,null,null,null,null,null,null,null,null,null,{"$f":"IFERROR(CONCATENATE(\"tCO2e/\",VLOOKUP($M42,'Emission factors'!$C:$H,6,FALSE)),\"\")","v":""},{"$f":"IFERROR(VLOOKUP($M42,'Emission factors'!$C:$BQ,9,FALSE),\"\")","v":""},{"$f":"IFERROR(VLOOKUP($M42,'Emission factors'!$C:$BQ,12,FALSE),\"\")","v":""},{"$f":"IFERROR(VLOOKUP($M42,'Emission factors'!$C:$BQ,15,FALSE),\"\")","v":""},{"$f":"IFERROR(VLOOKUP($M42,'Emission factors'!$C:$BQ,65,FALSE),\"\")","v":""},{"$f":"IFERROR(VLOOKUP($M42,'Emission factors'!$C:$BQ,67,FALSE),\"\")","v":""},null,null,null,null,null,null,{"$f":"IFERROR(IF(AND($M42=\"\",$T42=\"\"),\"\",IF($M42=\"\",IF(U42=0,\"-\",U42),IF(O42=0,\"0\",$G42*IF($K42=\"\",1,$K42)*O42))),\"-\")","v":""},"","",{"$f":"IFERROR(IF(AND($M42=\"\",$T42=\"\"),\"\",IF($M42=\"\",IF(X42=\"\",SUM(U42:W42),IF(X42=0,\"0\",X42)),IF($R42=\"\",SUM($Z42:$AB42),IF($R42=0,\"0\",$G42*IF($K42=\"\",1,$K42)*$R42)))),\"-\")","v":""},{"$f":"IFERROR(IF(AND($M42=\"\",$T42=\"\"),\"\",IF($M42=\"\",IF(Y42=0,\"-\",Y42),IF(S42=0,\"0\",$G42*IF($K42=\"\",1,$K42)*S42))),\"-\")","v":""}]
[null,"I.2.3",3,null,null,null,null,null,null,null,null,null,null,{"$f":"IFERROR(CONCATENATE(\"tCO2e/\",VLOOKUP($M43,'Emission factors'!$C:$H,6,FALSE)),\"\")","v":""},{"$f":"IFERROR(VLOOKUP($M43,'Emission factors'!$C:$BQ,9,FALSE),\"\")","v":""},{"$f":"IFERROR(VLOOKUP($M43,'Emission factors'!$C:$BQ,12,FALSE),\"\")","v":""},{"$f":"IFERROR(VLOOKUP($M43,'Emission factors'!$C:$BQ,15,FALSE),\"\")","v":""},{"$f":"IFERROR(VLOOKUP($M43,'Emission factors'!$C:$BQ,65,FALSE),\"\")","v":""},{"$f":"IFERROR(VLOOKUP($M43,'Emission factors'!$C:$BQ,67,FALSE),\"\")","v":""},null,null,null,null,null,null,"","","",{"$f":"IFERROR(IF(AND($M43=\"\",$T43=\"\"),\"\",IF($M43=\"\",IF(X43=\"\",SUM(U43:W43),IF(X43=0,\"0\",X43)),IF($R43=\"\",SUM($Z43:$AB43),IF($R43=0,\"0\",$G43*IF($K43=\"\",1,$K43)*$R43)))),\"-\")","v":""},{"$f":"IFERROR(IF(AND($M43=\"\",$T43=\"\"),\"\",IF($M43=\"\",IF(Y43=0,\"-\",Y43),IF(S43=0,\"0\",$G43*IF($K43=\"\",1,$K43)*S43))),\"-\")","v":""}]
[]
[null,"I.3 MANUFACTURING INDUSTRIES AND CONSTRUCTION"]
[]
[null,"GPC ref No.","Scope","GHG Emissions Source",null,"Notation \nkeys","Activity data",null,"Activity data multiplier",null,null,"Gas(es)","Emission factor","Emission factor",null,null,null,null,null,"Emissions data","GHGs (metric tonnes CO2e)",null,null,null,null,"GHGs (metric tonnes CO2e)",null,null,null,null,"Data Quality",null,"Description of method(s) used or explanation for using notation key(s)","Source","Data quality explanation (optional)"]
[null,null,null,"Activity","Description",null,"Amount","Units","From","To","Factor",null,null,"Units","CO2","CH4","N2O","Total tCO2e","CO2(b)",null,"CO2","CH4","N2O","Total tCO2e","CO2(b)","CO2","CH4","N2O","Total tCO2e","CO2(b)","AD","EF"]
[null,"I.3.1",1,"Emissions from fuel combustion within the city boundary"]
[null,"I.3.1",1,"Gas (natural gas)","Industrial",null,{"$f":"[2]SUMMARY!$B$46","v":158170408.49690467},null,null,null,null,"CO2, CH4, N2O","EF_natural gas Peoples",{"$f":"IFERROR(CONCATENATE(\"tCO2e/\",VLOOKUP($M50,'Emission factors'!$C:$H,6,FALSE)),\"\")","v":"tCO2e/therm"},{"$f":"IFERROR(VLOOKUP($M50,'Emission factors'!$C:$BQ,9,FALSE),\"\")","v":5.4920337870651694E-3},{"$f":"IFERROR(VLOOKUP($M50,'Emission factors'!$C:$BQ,12,FALSE),\"\")","v":1.97440102951291E-4},{"$f":"IFERROR(VLOOKUP($M50,'Emission factors'!$C:$BQ,15,FALSE),\"\")","v":3.0992598591280001E-6},{"$f":"IFERROR(VLOOKUP($M50,'Emission factors'!$C:$BQ,65,FALSE),\"\")","v":""},{"$f":"IFERROR(VLOOKUP($M50,'Emission factors'!$C:$BQ,67,FALSE),\"\")","v":""},null,null,null,null,null,null,{"$f":"IFERROR(IF(AND($M50=\"\",$T50=\"\"),\"\",IF($M50=\"\",IF(U50=0,\"-\",U50),IF(O50=0,\"0\",$G50*IF($K50=\"\",1,$K50)*O50))),\"-\")","v":868677.22757890017},31229.181737476611,490.21119795633501,{"$f":"IFERROR(IF(AND($M50=\"\",$T50=\"\"),\"\",IF($M50=\"\",IF(X50=\"\",SUM(U50:W50),IF(X50=0,\"0\",X50)),IF($R50=\"\",SUM($Z50:$AB50),IF($R50=0,\"0\",$G50*IF($K50=\"\",1,$K50)*$R50)))),\"-\")","v":900396.62051433313},{"$f":"IFERROR(IF(AND($M50=\"\",$T50=\"\"),\"\",IF($M50=\"\",IF(Y50=0,\"-\",Y50),IF(S50=0,\"0\",$G50*IF($K50=\"\",1,$K50)*S50))),\"-\")","v":"-"}]
[null,"I.3.1",1,"Diesel oil ","Construction and mining equipment (offroad)",null,null,null,null,null,null,"CO2, CH4, N2O",null,{"$f":"IFERROR(CONCATENATE(\"tCO2e/\",VLOOKUP($M51,'Emission factors'!$C:$H,6,FALSE)),\"\")","v":""},{"$f":"IFERROR(VLOOKUP($M51,'Emission factors'!$C:$BQ,9,FALSE),\"\")","v":""},{"$f":"IFERROR(VLOOKUP($M51,'Emission factors'!$C:$BQ,12,FALSE),\"\")","v":""},{"$f":"IFERROR(VLOOKUP($M51,'Emission factors'!$C:$BQ,15,FALSE),\"\")","v":""},{"$f":"IFERROR(VLOOKUP($M51,'Emission factors'!$C:$BQ,65,FALSE),\"\")","v":""},{"$f":"IFERROR(VLOOKUP($M51,'Emission factors'!$C:$BQ,67,FALSE),\"\")","v":""},"✓",null,null,null,{"$f":"'[4]NONROAD Summary totals'!$I$29","v":278258.03120267688},null,"-","-","-",{"$f":"IFERROR(IF(AND($M51=\"\",$T51=\"\"),\"\",IF($M51=\"\",IF(X51=\"\",SUM(U51:W51),IF(X51=0,\"0\",X51)),IF($R51=\"\",SUM($Z51:$AB51),IF($R51=0,\"0\",$G51*IF($K51=\"\",1,$K51)*$R51)))),\"-\")","v":278258.03120267688},{"$f":"IFERROR(IF(AND($M51=\"\",$T51=\"\"),\"\",IF($M51=\"\",IF(Y51=0,\"-\",Y51),IF(S51=0,\"0\",$G51*IF($K51=\"\",1,$K51)*S51))),\"-\")","v":"-"}]
[null,"I.3.1",1,"Diesel oil ","Industrial equipment (offroad)",null,null,null,null,null,null,"CO2, CH4, N2O",null,{"$f":"IFERROR(CONCATENATE(\"tCO2e/\",VLOOKUP($M52,'Emission factors'!$C:$H,6,FALSE)),\"\")","v":""},{"$f":"IFERROR(VLOOKUP($M52,'Emission factors'!$C:$BQ,9,FALSE),\"\")","v":""},{"$f":"IFERROR(VLOOKUP($M52,'Emission factors'!$C:$BQ,12,FALSE),\"\")","v":""},{"$f":"IFERROR(VLOOKUP($M52,'Emission factors'!$C:$BQ,15,FALSE),\"\")","v":""},{"$f":"IFERROR(VLOOKUP($M52,'Emission factors'!$C:$BQ,65,FALSE),\"\")","v":""},{"$f":"IFERROR(VLOOKUP($M52,'Emission factors'!$C:$BQ,67,FALSE),\"\")","v":""},"✓",null,null,null,{"$f":"'[4]NONROAD Summary totals'!$I$61","v":172285.91800227275},null,{"$f":"IFERROR(IF(AND($M52=\"\",$T52=\"\"),\"\",IF($M52=\"\",IF(U52=0,\"-\",U52),IF(O52=0,\"0\",$G52*IF($K52=\"\",1,$K52)*O52))),\"-\")","v":"-"},{"$f":"IFERROR(IF(AND($M52=\"\",$T52=\"\"),\"\",IF($M52=\"\",IF(V52=0,\"-\",V52),IF(P52=0,\"0\",$G52*IF($K52=\"\",1,$K52)*P52))),\"-\")","v":"-"},{"$f":"IFERROR(IF(AND($M52=\"\",$T52=\"\"),\"\",IF($M52=\"\",IF(W52=0,\"-\",W52),IF(Q52=0,\"0\",$G52*IF($K52=\"\",1,$K52)*Q52))),\"-\")","v":"-"},{"$f":"IFERROR(IF(AND($M52=\"\",$T52=\"\"),\"\",IF($M52=\"\",IF(X52=\"\",SUM(U52:W52),IF(X52=0,\"0\",X52)),IF($R52=\"\",SUM($Z52:$AB52),IF($R52=0,\"0\",$G52*IF($K52=\"\",1,$K52)*$R52)))),\"-\")","v":172285.91800227275},{"$f":"IFERROR(IF(AND($M52=\"\",$T52=\"\"),\"\",IF($M52=\"\",IF(Y52=0,\"-\",Y52),IF(S52=0,\"0\",$G52*IF($K52=\"\",1,$K52)*S52))),\"-\")","v":"-"}]
[null,"I.3.2",2,"Emissions from grid-supplied energy consumed within the city boundary",null,"IE",null,null,null,null,null,null,null,null,null,null,null,null,null,null,null,null,null,null,null,null,null,null,null,null,null,null,"I.3.2 is included in I.2.2"]
[null,"I.3.2",2,null,null,null,null,null,null,null,null,null,null,{"$f":"IFERROR(CONCATENATE(\"tCO2e/\",VLOOKUP($M54,'Emission factors'!$C:$H,6,FALSE)),\"\")","v":""},{"$f":"IFERROR(VLOOKUP($M54,'Emission factors'!$C:$BQ,9,FALSE),\"\")","v":""},{"$f":"IFERROR(VLOOKUP($M54,'Emission factors'!$C:$BQ,12,FALSE),\"\")","v":""},{"$f":"IFERROR(VLOOKUP($M54,'Emission factors'!$C:$BQ,15,FALSE),\"\")","v":""},{"$f":"IFERROR(VLOOKUP($M54,'Emission factors'!$C:$BQ,65,FALSE),\"\")","v":""},{"$f":"IFERROR(VLOOKUP($M54,'Emission factors'!$C:$BQ,67,FALSE),\"\")","v":""},null,null,null,null,null,null,{"$f":"IFERROR(IF(AND($M54=\"\",$T54=\"\"),\"\",IF($M54=\"\",IF(U54=0,\"-\",U54),IF(O54=0,\"0\",$G54*IF($K54=\"\",1,$K54)*O54))),\"-\")","v":""},"","",{"$f":"IFERROR(IF(AND($M54=\"\",$T54=\"\"),\"\",IF($M54=\"\",IF(X54=\"\",SUM(U54:W54),IF(X54=0,\"0\",X54)),IF($R54=\"\",SUM($Z54:$AB54),IF($R54=0,\"0\",$G54*IF($K54=\"\",1,$K54)*$R54)))),\"-\")","v":""},{"$f":"IFERROR(IF(AND($M54=\"\",$T54=\"\"),\"\",IF($M54=\"\",IF(Y54=0,\"-\",Y54),IF(S54=0,\"0\",$G54*IF($K54=\"\",1,$K54)*S54))),\"-\")","v":""}]
[null,"I.3.2",2,null,null,null,null,null,null,null,null,null,null,{"$f":"IFERROR(CONCATENATE(\"tCO2e/\",VLOOKUP($M55,'Emission factors'!$C:$H,6,FALSE)),\"\")","v":""},{"$f":"IFERROR(VLOOKUP($M55,'Emission factors'!$C:$BQ,9,FALSE),\"\")","v":""},{"$f":"IFERROR(VLOOKUP($M55,'Emission factors'!$C:$BQ,12,FALSE),\"\")","v":""},{"$f":"IFERROR(VLOOKUP($M55,'Emission factors'!$C:$BQ,15,FALSE),\"\")","v":""},{"$f":"IFERROR(VLOOKUP($M55,'Emission factors'!$C:$BQ,65,FALSE),\"\")","v":""},{"$f":"IFERROR(VLOOKUP($M55,'Emission factors'!$C:$BQ,67,FALSE),\"\")","v":""},null,null,null,null,null,null,"","","",{"$f":"IFERROR(IF(AND($M55=\"\",$T55=\"\"),\"\",IF($M55=\"\",IF(X55=\"\",SUM(U55:W55),IF(X55=0,\"0\",X55)),IF($R55=\"\",SUM($Z55:$AB55),IF($R55=0,\"0\",$G55*IF($K55=\"\",1,$K55)*$R55)))),\"-\")","v":""},{"$f":"IFERROR(IF(AND($M55=\"\",$T55=\"\"),\"\",IF($M55=\"\",IF(Y55=0,\"-\",Y55),IF(S55=0,\"0\",$G55*IF($K55=\"\",1,$K55)*S55))),\"-\")","v":""}]
[null,"I.3.3",3,"Transmission and distribution losses from grid-supplied energy",null,"NE"]
[null,"I.3.3",3,null,null,null,null,null,null,null,null,null,null,{"$f":"IFERROR(CONCATENATE(\"tCO2e/\",VLOOKUP($M57,'Emission factors'!$C:$H,6,FALSE)),\"\")","v":""},{"$f":"IFERROR(VLOOKUP($M57,'Emission factors'!$C:$BQ,9,FALSE),\"\")","v":""},{"$f":"IFERROR(VLOOKUP($M57,'Emission factors'!$C:$BQ,12,FALSE),\"\")","v":""},{"$f":"IFERROR(VLOOKUP($M57,'Emission factors'!$C:$BQ,15,FALSE),\"\")","v":""},{"$f":"IFERROR(VLOOKUP($M57,'Emission factors'!$C:$BQ,65,FALSE),\"\")","v":""},{"$f":"IFERROR(VLOOKUP($M57,'Emission factors'!$C:$BQ,67,FALSE),\"\")","v":""},null,null,null,null,null,null,{"$f":"IFERROR(IF(AND($M57=\"\",$T57=\"\"),\"\",IF($M57=\"\",IF(U57=0,\"-\",U57),IF(O57=0,\"0\",$G57*IF($K57=\"\",1,$K57)*O57))),\"-\")","v":""},"","",{"$f":"IFERROR(IF(AND($M57=\"\",$T57=\"\"),\"\",IF($M57=\"\",IF(X57=\"\",SUM(U57:W57),IF(X57=0,\"0\",X57)),IF($R57=\"\",SUM($Z57:$AB57),IF($R57=0,\"0\",$G57*IF($K57=\"\",1,$K57)*$R57)))),\"-\")","v":""},{"$f":"IFERROR(IF(AND($M57=\"\",$T57=\"\"),\"\",IF($M57=\"\",IF(Y57=0,\"-\",Y57),IF(S57=0,\"0\",$G57*IF($K57=\"\",1,$K57)*S57))),\"-\")","v":""}]
[null,"I.3.3",3,null,null,null,null,null,null,null,null,null,null,{"$f":"IFERROR(CONCATENATE(\"tCO2e/\",VLOOKUP($M58,'Emission factors'!$C:$H,6,FALSE)),\"\")","v":""},{"$f":"IFERROR(VLOOKUP($M58,'Emission factors'!$C:$BQ,9,FALSE),\"\")","v":""},{"$f":"IFERROR(VLOOKUP($M58,'Emission factors'!$C:$BQ,12,FALSE),\"\")","v":""},{"$f":"IFERROR(VLOOKUP($M58,'Emission factors'!$C:$BQ,15,FALSE),\"\")","v":""},{"$f":"IFERROR(VLOOKUP($M58,'Emission factors'!$C:$BQ,65,FALSE),\"\")","v":""},{"$f":"IFERROR(VLOOKUP($M58,'Emission factors'!$C:$BQ,67,FALSE),\"\")","v":""},null,null,null,null,null,null,"","","",{"$f":"IFERROR(IF(AND($M58=\"\",$T58=\"\"),\"\",IF($M58=\"\",IF(X58=\"\",SUM(U58:W58),IF(X58=0,\"0\",X58)),IF($R58=\"\",SUM($Z58:$AB58),IF($R58=0,\"0\",$G58*IF($K58=\"\",1,$K58)*$R58)))),\"-\")","v":""},{"$f":"IFERROR(IF(AND($M58=\"\",$T58=\"\"),\"\",IF($M58=\"\",IF(Y58=0,\"-\",Y58),IF(S58=0,\"0\",$G58*IF($K58=\"\",1,$K58)*S58))),\"-\")","v":""}]
[]
[null,"I.4 ENERGY INDUSTRIES"]
[]
[null,"GPC ref No.","Scope","GHG Emissions Source",null,"Notation \nkeys","Activity data",null,"Activity data multiplier",null,null,"Gas(es)","Emission factor","Emission factor",null,null,null,null,null,"Emissions data","GHGs (metric tonnes CO2e)",null,null,null,null,"GHGs (metric tonnes CO2e)",null,null,null,null,"Data Quality",null,"Description of method(s) used or explanation for using notation key(s)","Source","Data quality explanation (optional)"]
[null,null,null,"Activity","Description",null,"Amount","Units","From","To","Factor",null,null,"Units","CO2","CH4","N2O","Total tCO2e","CO2(b)",null,"CO2","CH4","N2O","Total tCO2e","CO2(b)","CO2","CH4","N2O","Total tCO2e","CO2(b)","AD","EF"]
[null,"I.4.1",1,"Emissions from energy used in power plant auxiliary operations within the city",null,"NO",null,null,null,null,null,null,null,null,null,null,null,null,null,null,null,null,null,null,null,null,null,null,null,null,null,null,"I.4.1 does not occur"]
[null,"I.4.1",1,null,null,null,null,null,null,null,null,null,null,{"$f":"IFERROR(CONCATENATE(\"tCO2e/\",VLOOKUP($M65,'Emission factors'!$C:$H,6,FALSE)),\"\")","v":""},{"$f":"IFERROR(VLOOKUP($M65,'Emission factors'!$C:$BQ,9,FALSE),\"\")","v":""},{"$f":"IFERROR(VLOOKUP($M65,'Emission factors'!$C:$BQ,12,FALSE),\"\")","v":""},{"$f":"IFERROR(VLOOKUP($M65,'Emission factors'!$C:$BQ,15,FALSE),\"\")","v":""},{"$f":"IFERROR(VLOOKUP($M65,'Emission factors'!$C:$BQ,65,FALSE),\"\")","v":""},{"$f":"IFERROR(VLOOKUP($M65,'Emission factors'!$C:$BQ,67,FALSE),\"\")","v":""},null,null,null,null,null,null,{"$f":"IFERROR(IF(AND($M65=\"\",$T65=\"\"),\"\",IF($M65=\"\",IF(U65=0,\"-\",U65),IF(O65=0,\"0\",$G65*IF($K65=\"\",1,$K65)*O65))),\"-\")","v":""},"","",{"$f":"IFERROR(IF(AND($M65=\"\",$T65=\"\"),\"\",IF($M65=\"\",IF(X65=\"\",SUM(U65:W65),IF(X65=0,\"0\",X65)),IF($R65=\"\",SUM($Z65:$AB65),IF($R65=0,\"0\",$G65*IF($K65=\"\",1,$K65)*$R65)))),\"-\")","v":""},{"$f":"IFERROR(IF(AND($M65=\"\",$T65=\"\"),\"\",IF($M65=\"\",IF(Y65=0,\"-\",Y65),IF(S65=0,\"0\",$G65*IF($K65=\"\",1,$K65)*S65))),\"-\")","v":""}]
[null,"I.4.1",1,null,null,null,null,null,null,null,null,null,null,{"$f":"IFERROR(CONCATENATE(\"tCO2e/\",VLOOKUP($M66,'Emission factors'!$C:$H,6,FALSE)),\"\")","v":""},{"$f":"IFERROR(VLOOKUP($M66,'Emission factors'!$C:$BQ,9,FALSE),\"\")","v":""},{"$f":"IFERROR(VLOOKUP($M66,'Emission factors'!$C:$BQ,12,FALSE),\"\")","v":""},{"$f":"IFERROR(VLOOKUP($M66,'Emission factors'!$C:$BQ,15,FALSE),\"\")","v":""},{"$f":"IFERROR(VLOOKUP($M66,'Emission factors'!$C:$BQ,65,FALSE),\"\")","v":""},{"$f":"IFERROR(VLOOKUP($M66,'Emission factors'!$C:$BQ,67,FALSE),\"\")","v":""},null,null,null,null,null,null,"","","",{"$f":"IFERROR(IF(AND($M66=\"\",$T66=\"\"),\"\",IF($M66=\"\",IF(X66=\"\",SUM(U66:W66),IF(X66=0,\"0\",X66)),IF($R66=\"\",SUM($Z66:$AB66),IF($R66=0,\"0\",$G66*IF($K66=\"\",1,$K66)*$R66)))),\"-\")","v":""},{"$f":"IFERROR(IF(AND($M66=\"\",$T66=\"\"),\"\",IF($M66=\"\",IF(Y66=0,\"-\",Y66),IF(S66=0,\"0\",$G66*IF($K66=\"\",1,$K66)*S66))),\"-\")","v":""}]
[null,"I.4.2",2,"Emissions from grid-supplied energy consumed  in power plant auxiliary operations within the city",null,"NO",null,null,null,null,null,null,null,null,null,null,null,null,null,null,null,null,null,null,null,null,null,null,null,null,null,null,"I.4.2 does not occur"]
[null,"I.4.2",2,null,null,null,null,null,null,null,null,null,null,{"$f":"IFERROR(CONCATENATE(\"tCO2e/\",VLOOKUP($M68,'Emission factors'!$C:$H,6,FALSE)),\"\")","v":""},{"$f":"IFERROR(VLOOKUP($M68,'Emission factors'!$C:$BQ,9,FALSE),\"\")","v":""},{"$f":"IFERROR(VLOOKUP($M68,'Emission factors'!$C:$BQ,12,FALSE),\"\")","v":""},{"$f":"IFERROR(VLOOKUP($M68,'Emission factors'!$C:$BQ,15,FALSE),\"\")","v":""},{"$f":"IFERROR(VLOOKUP($M68,'Emission factors'!$C:$BQ,65,FALSE),\"\")","v":""},{"$f":"IFERROR(VLOOKUP($M68,'Emission factors'!$C:$BQ,67,FALSE),\"\")","v":""},null,null,null,null,null,null,{"$f":"IFERROR(IF(AND($M68=\"\",$T68=\"\"),\"\",IF($M68=\"\",IF(U68=0,\"-\",U68),IF(O68=0,\"0\",$G68*IF($K68=\"\",1,$K68)*O68))),\"-\")","v":""},"","",{"$f":"IFERROR(IF(AND($M68=\"\",$T68=\"\"),\"\",IF($M68=\"\",IF(X68=\"\",SUM(U68:W68),IF(X68=0,\"0\",X68)),IF($R68=\"\",SUM($Z68:$AB68),IF($R68=0,\"0\",$G68*IF($K68=\"\",1,$K68)*$R68)))),\"-\")","v":""},{"$f":"IFERROR(IF(AND($M68=\"\",$T68=\"\"),\"\",IF($M68=\"\",IF(Y68=0,\"-\",Y68),IF(S68=0,\"0\",$G68*IF($K68=\"\",1,$K68)*S68))),\"-\")","v":""}]
[null,"I.4.2",2,null,null,null,null,null,null,null,null,null,null,{"$f":"IFERROR(CONCATENATE(\"tCO2e/\",VLOOKUP($M69,'Emission factors'!$C:$H,6,FALSE)),\"\")","v":""},{"$f":"IFERROR(VLOOKUP($M69,'Emission factors'!$C:$BQ,9,FALSE),\"\")","v":""},{"$f":"IFERROR(VLOOKUP($M69,'Emission factors'!$C:$BQ,12,FALSE),\"\")","v":""},{"$f":"IFERROR(VLOOKUP($M69,'Emission factors'!$C:$BQ,15,FALSE),\"\")","v":""},{"$f":"IFERROR(VLOOKUP($M69,'Emission factors'!$C:$BQ,65,FALSE),\"\")","v":""},{"$f":"IFERROR(VLOOKUP($M69,'Emission factors'!$C:$BQ,67,FALSE),\"\")","v":""},null,null,null,null,null,null,"","","",{"$f":"IFERROR(IF(AND($M69=\"\",$T69=\"\"),\"\",IF($M69=\"\",IF(X69=\"\",SUM(U69:W69),IF(X69=0,\"0\",X69)),IF($R69=\"\",SUM($Z69:$AB69),IF($R69=0,\"0\",$G69*IF($K69=\"\",1,$K69)*$R69)))),\"-\")","v":""},{"$f":"IFERROR(IF(AND($M69=\"\",$T69=\"\"),\"\",IF($M69=\"\",IF(Y69=0,\"-\",Y69),IF(S69=0,\"0\",$G69*IF($K69=\"\",1,$K69)*S69))),\"-\")","v":""}]
[null,"I.4.3",3,"Emissions from transmission and distribution losses from grid-supplied energy used in power plant auxiliary operations",null,"NO",null,null,null,null,null,null,null,null,null,null,null,null,null,null,null,null,null,null,null,null,null,null,null,null,null,null,"I.4.3 does not occur"]
[null,"I.4.3",3,null,null,null,null,null,null,null,null,null,null,{"$f":"IFERROR(CONCATENATE(\"tCO2e/\",VLOOKUP($M71,'Emission factors'!$C:$H,6,FALSE)),\"\")","v":""},{"$f":"IFERROR(VLOOKUP($M71,'Emission factors'!$C:$BQ,9,FALSE),\"\")","v":""},{"$f":"IFERROR(VLOOKUP($M71,'Emission factors'!$C:$BQ,12,FALSE),\"\")","v":""},{"$f":"IFERROR(VLOOKUP($M71,'Emission factors'!$C:$BQ,15,FALSE),\"\")","v":""},{"$f":"IFERROR(VLOOKUP($M71,'Emission factors'!$C:$BQ,65,FALSE),\"\")","v":""},{"$f":"IFERROR(VLOOKUP($M71,'Emission factors'!$C:$BQ,67,FALSE),\"\")","v":""},null,null,null,null,null,null,{"$f":"IFERROR(IF(AND($M71=\"\",$T71=\"\"),\"\",IF($M71=\"\",IF(U71=0,\"-\",U71),IF(O71=0,\"0\",$G71*IF($K71=\"\",1,$K71)*O71))),\"-\")","v":""},"","",{"$f":"IFERROR(IF(AND($M71=\"\",$T71=\"\"),\"\",IF($M71=\"\",IF(X71=\"\",SUM(U71:W71),IF(X71=0,\"0\",X71)),IF($R71=\"\",SUM($Z71:$AB71),IF($R71=0,\"0\",$G71*IF($K71=\"\",1,$K71)*$R71)))),\"-\")","v":""},{"$f":"IFERROR(IF(AND($M71=\"\",$T71=\"\"),\"\",IF($M71=\"\",IF(Y71=0,\"-\",Y71),IF(S71=0,\"0\",$G71*IF($K71=\"\",1,$K71)*S71))),\"-\")","v":""}]
[null,"I.4.3",3,null,null,null,null,null,null,null,null,null,null,{"$f":"IFERROR(CONCATENATE(\"tCO2e/\",VLOOKUP($M72,'Emission factors'!$C:$H,6,FALSE)),\"\")","v":""},{"$f":"IFERROR(VLOOKUP($M72,'Emission factors'!$C:$BQ,9,FALSE),\"\")","v":""},{"$f":"IFERROR(VLOOKUP($M72,'Emission factors'!$C:$BQ,12,FALSE),\"\")","v":""},{"$f":"IFERROR(VLOOKUP($M72,'Emission factors'!$C:$BQ,15,FALSE),\"\")","v":""},{"$f":"IFERROR(VLOOKUP($M72,'Emission factors'!$C:$BQ,65,FALSE),\"\")","v":""},{"$f":"IFERROR(VLOOKUP($M72,'Emission factors'!$C:$BQ,67,FALSE),\"\")","v":""},null,null,null,null,null,null,"","","",{"$f":"IFERROR(IF(AND($M72=\"\",$T72=\"\"),\"\",IF($M72=\"\",IF(X72=\"\",SUM(U72:W72),IF(X72=0,\"0\",X72)),IF($R72=\"\",SUM($Z72:$AB72),IF($R72=0,\"0\",$G72*IF($K72=\"\",1,$K72)*$R72)))),\"-\")","v":""},{"$f":"IFERROR(IF(AND($M72=\"\",$T72=\"\"),\"\",IF($M72=\"\",IF(Y72=0,\"-\",Y72),IF(S72=0,\"0\",$G72*IF($K72=\"\",1,$K72)*S72))),\"-\")","v":""}]
[null,"I.4.4",1,"Emissions from energy generation supplied to the grid",null,"NO",null,null,null,null,null,null,null,null,null,null,null,null,null,null,null,null,null,null,null,null,null,null,null,null,null,null,"I.4.4 does not occur"]
[null,"I.4.4",1,null,null,null,null,null,null,null,null,null,null,{"$f":"IFERROR(CONCATENATE(\"tCO2e/\",VLOOKUP($M74,'Emission factors'!$C:$H,6,FALSE)),\"\")","v":""},{"$f":"IFERROR(VLOOKUP($M74,'Emission factors'!$C:$BQ,9,FALSE),\"\")","v":""},{"$f":"IFERROR(VLOOKUP($M74,'Emission factors'!$C:$BQ,12,FALSE),\"\")","v":""},{"$f":"IFERROR(VLOOKUP($M74,'Emission factors'!$C:$BQ,15,FALSE),\"\")","v":""},{"$f":"IFERROR(VLOOKUP($M74,'Emission factors'!$C:$BQ,65,FALSE),\"\")","v":""},{"$f":"IFERROR(VLOOKUP($M74,'Emission factors'!$C:$BQ,67,FALSE),\"\")","v":""},null,null,null,null,null,null,{"$f":"IFERROR(IF(AND($M74=\"\",$T74=\"\"),\"\",IF($M74=\"\",IF(U74=0,\"-\",U74),IF(O74=0,\"0\",$G74*IF($K74=\"\",1,$K74)*O74))),\"-\")","v":""},"","",{"$f":"IFERROR(IF(AND($M74=\"\",$T74=\"\"),\"\",IF($M74=\"\",IF(X74=\"\",SUM(U74:W74),IF(X74=0,\"0\",X74)),IF($R74=\"\",SUM($Z74:$AB74),IF($R74=0,\"0\",$G74*IF($K74=\"\",1,$K74)*$R74)))),\"-\")","v":""},{"$f":"IFERROR(IF(AND($M74=\"\",$T74=\"\"),\"\",IF($M74=\"\",IF(Y74=0,\"-\",Y74),IF(S74=0,\"0\",$G74*IF($K74=\"\",1,$K74)*S74))),\"-\")","v":""}]
[null,"I.4.4",1,null,null,null,null,null,null,null,null,null,null,{"$f":"IFERROR(CONCATENATE(\"tCO2e/\",VLOOKUP($M75,'Emission factors'!$C:$H,6,FALSE)),\"\")","v":""},{"$f":"IFERROR(VLOOKUP($M75,'Emission factors'!$C:$BQ,9,FALSE),\"\")","v":""},{"$f":"IFERROR(VLOOKUP($M75,'Emission factors'!$C:$BQ,12,FALSE),\"\")","v":""},{"$f":"IFERROR(VLOOKUP($M75,'Emission factors'!$C:$BQ,15,FALSE),\"\")","v":""},{"$f":"IFERROR(VLOOKUP($M75,'Emission factors'!$C:$BQ,65,FALSE),\"\")","v":""},{"$f":"IFERROR(VLOOKUP($M75,'Emission factors'!$C:$BQ,67,FALSE),\"\")","v":""},null,null,null,null,null,null,"","","",{"$f":"IFERROR(IF(AND($M75=\"\",$T75=\"\"),\"\",IF($M75=\"\",IF(X75=\"\",SUM(U75:W75),IF(X75=0,\"0\",X75)),IF($R75=\"\",SUM($Z75:$AB75),IF($R75=0,\"0\",$G75*IF($K75=\"\",1,$K75)*$R75)))),\"-\")","v":""},{"$f":"IFERROR(IF(AND($M75=\"\",$T75=\"\"),\"\",IF($M75=\"\",IF(Y75=0,\"-\",Y75),IF(S75=0,\"0\",$G75*IF($K75=\"\",1,$K75)*S75))),\"-\")","v":""}]
[]
[null,"I.5 AGRICULTURE, FORESTRY AND FISHING ACTIVITIES"]
[]
[null,"GPC ref No.","Scope","GHG Emissions Source",null,"Notation \nkeys","Activity data",null,"Activity data multiplier",null,null,"Gas(es)","Emission factor","Emission factor",null,null,null,null,null,"Emissions data","GHGs (metric tonnes CO2e)",null,null,null,null,"GHGs (metric tonnes CO2e)",null,null,null,null,"Data Quality",null,"Description of method(s) used or explanation for using notation key(s)","Source","Data quality explanation (optional)"]
[null,null,null,"Activity","Description",null,"Amount","Units","From","To","Factor",null,null,"Units","CO2","CH4","N2O","Total tCO2e","CO2(b)",null,"CO2","CH4","N2O","Total tCO2e","CO2(b)","CO2","CH4","N2O","Total tCO2e","CO2(b)","AD","EF"]
[null,"I.5.1",1,"Emissions from fuel combustion within the city boundary",null,"NO",null,null,null,null,null,null,null,null,null,null,null,null,null,null,null,null,null,null,null,null,null,null,null,null,null,null,"I.5.1 does not occur; no agricultural activities within the city boundary"]
[null,"I.5.1",1,null,null,null,null,null,null,null,null,null,null,{"$f":"IFERROR(CONCATENATE(\"tCO2e/\",VLOOKUP($M82,'Emission factors'!$C:$H,6,FALSE)),\"\")","v":""},{"$f":"IFERROR(VLOOKUP($M82,'Emission factors'!$C:$BQ,9,FALSE),\"\")","v":""},{"$f":"IFERROR(VLOOKUP($M82,'Emission factors'!$C:$BQ,12,FALSE),\"\")","v":""},{"$f":"IFERROR(VLOOKUP($M82,'Emission factors'!$C:$BQ,15,FALSE),\"\")","v":""},{"$f":"IFERROR(VLOOKUP($M82,'Emission factors'!$C:$BQ,65,FALSE),\"\")","v":""},{"$f":"IFERROR(VLOOKUP($M82,'Emission factors'!$C:$BQ,67,FALSE),\"\")","v":""},null,null,null,null,null,null,{"$f":"IFERROR(IF(AND($M82=\"\",$T82=\"\"),\"\",IF($M82=\"\",IF(U82=0,\"-\",U82),IF(O82=0,\"0\",$G82*IF($K82=\"\",1,$K82)*O82))),\"-\")","v":""},"","",{"$f":"IFERROR(IF(AND($M82=\"\",$T82=\"\"),\"\",IF($M82=\"\",IF(X82=\"\",SUM(U82:W82),IF(X82=0,\"0\",X82)),IF($R82=\"\",SUM($Z82:$AB82),IF($R82=0,\"0\",$G82*IF($K82=\"\",1,$K82)*$R82)))),\"-\")","v":""},{"$f":"IFERROR(IF(AND($M82=\"\",$T82=\"\"),\"\",IF($M82=\"\",IF(Y82=0,\"-\",Y82),IF(S82=0,\"0\",$G82*IF($K82=\"\",1,$K82)*S82))),\"-\")","v":""}]
[null,"I.5.1",1,null,null,null,null,null,null,null,null,null,null,{"$f":"IFERROR(CONCATENATE(\"tCO2e/\",VLOOKUP($M83,'Emission factors'!$C:$H,6,FALSE)),\"\")","v":""},{"$f":"IFERROR(VLOOKUP($M83,'Emission factors'!$C:$BQ,9,FALSE),\"\")","v":""},{"$f":"IFERROR(VLOOKUP($M83,'Emission factors'!$C:$BQ,12,FALSE),\"\")","v":""},{"$f":"IFERROR(VLOOKUP($M83,'Emission factors'!$C:$BQ,15,FALSE),\"\")","v":""},{"$f":"IFERROR(VLOOKUP($M83,'Emission factors'!$C:$BQ,65,FALSE),\"\")","v":""},{"$f":"IFERROR(VLOOKUP($M83,'Emission factors'!$C:$BQ,67,FALSE),\"\")","v":""},null,null,null,null,null,null,"","","",{"$f":"IFERROR(IF(AND($M83=\"\",$T83=\"\"),\"\",IF($M83=\"\",IF(X83=\"\",SUM(U83:W83),IF(X83=0,\"0\",X83)),IF($R83=\"\",SUM($Z83:$AB83),IF($R83=0,\"0\",$G83*IF($K83=\"\",1,$K83)*$R83)))),\"-\")","v":""},{"$f":"IFERROR(IF(AND($M83=\"\",$T83=\"\"),\"\",IF($M83=\"\",IF(Y83=0,\"-\",Y83),IF(S83=0,\"0\",$G83*IF($K83=\"\",1,$K83)*S83))),\"-\")","v":""}]
[null,"I.5.2",2,"Emissions from grid-supplied energy consumed within the city boundary",null,"NO",null,null,null,null,null,null,null,null,null,null,null,null,null,null,null,null,null,null,null,null,null,null,null,null,null,null,"I.5.2 does not occur; no agricultural activities within the city boundary"]
[null,"I.5.2",2,null,null,null,null,null,null,null,null,null,null,{"$f":"IFERROR(CONCATENATE(\"tCO2e/\",VLOOKUP($M85,'Emission factors'!$C:$H,6,FALSE)),\"\")","v":""},{"$f":"IFERROR(VLOOKUP($M85,'Emission factors'!$C:$BQ,9,FALSE),\"\")","v":""},{"$f":"IFERROR(VLOOKUP($M85,'Emission factors'!$C:$BQ,12,FALSE),\"\")","v":""},{"$f":"IFERROR(VLOOKUP($M85,'Emission factors'!$C:$BQ,15,FALSE),\"\")","v":""},{"$f":"IFERROR(VLOOKUP($M85,'Emission factors'!$C:$BQ,65,FALSE),\"\")","v":""},{"$f":"IFERROR(VLOOKUP($M85,'Emission factors'!$C:$BQ,67,FALSE),\"\")","v":""},null,null,null,null,null,null,{"$f":"IFERROR(IF(AND($M85=\"\",$T85=\"\"),\"\",IF($M85=\"\",IF(U85=0,\"-\",U85),IF(O85=0,\"0\",$G85*IF($K85=\"\",1,$K85)*O85))),\"-\")","v":""},"","",{"$f":"IFERROR(IF(AND($M85=\"\",$T85=\"\"),\"\",IF($M85=\"\",IF(X85=\"\",SUM(U85:W85),IF(X85=0,\"0\",X85)),IF($R85=\"\",SUM($Z85:$AB85),IF($R85=0,\"0\",$G85*IF($K85=\"\",1,$K85)*$R85)))),\"-\")","v":""},{"$f":"IFERROR(IF(AND($M85=\"\",$T85=\"\"),\"\",IF($M85=\"\",IF(Y85=0,\"-\",Y85),IF(S85=0,\"0\",$G85*IF($K85=\"\",1,$K85)*S85))),\"-\")","v":""}]
[null,"I.5.2",2,null,null,null,null,null,null,null,null,null,null,{"$f":"IFERROR(CONCATENATE(\"tCO2e/\",VLOOKUP($M86,'Emission factors'!$C:$H,6,FALSE)),\"\")","v":""},{"$f":"IFERROR(VLOOKUP($M86,'Emission factors'!$C:$BQ,9,FALSE),\"\")","v":""},{"$f":"IFERROR(VLOOKUP($M86,'Emission factors'!$C:$BQ,12,FALSE),\"\")","v":""},{"$f":"IFERROR(VLOOKUP($M86,'Emission factors'!$C:$BQ,15,FALSE),\"\")","v":""},{"$f":"IFERROR(VLOOKUP($M86,'Emission factors'!$C:$BQ,65,FALSE),\"\")","v":""},{"$f":"IFERROR(VLOOKUP($M86,'Emission factors'!$C:$BQ,67,FALSE),\"\")","v":""},null,null,null,null,null,null,"","","",{"$f":"IFERROR(IF(AND($M86=\"\",$T86=\"\"),\"\",IF($M86=\"\",IF(X86=\"\",SUM(U86:W86),IF(X86=0,\"0\",X86)),IF($R86=\"\",SUM($Z86:$AB86),IF($R86=0,\"0\",$G86*IF($K86=\"\",1,$K86)*$R86)))),\"-\")","v":""},{"$f":"IFERROR(IF(AND($M86=\"\",$T86=\"\"),\"\",IF($M86=\"\",IF(Y86=0,\"-\",Y86),IF(S86=0,\"0\",$G86*IF($K86=\"\",1,$K86)*S86))),\"-\")","v":""}]
[null,"I.5.3",3,"Transmission and distribution losses from grid-supplied energy consumption",null,"NO",null,null,null,null,null,null,null,null,null,null,null,null,null,null,null,null,null,null,null,null,null,null,null,null,null,null,"I.5.3 does not occur; no agricultural activities within the city boundary"]
[null,"I.5.3",3,null,null,null,null,null,null,null,null,null,null,{"$f":"IFERROR(CONCATENATE(\"tCO2e/\",VLOOKUP($M88,'Emission factors'!$C:$H,6,FALSE)),\"\")","v":""},{"$f":"IFERROR(VLOOKUP($M88,'Emission factors'!$C:$BQ,9,FALSE),\"\")","v":""},{"$f":"IFERROR(VLOOKUP($M88,'Emission factors'!$C:$BQ,12,FALSE),\"\")","v":""},{"$f":"IFERROR(VLOOKUP($M88,'Emission factors'!$C:$BQ,15,FALSE),\"\")","v":""},{"$f":"IFERROR(VLOOKUP($M88,'Emission factors'!$C:$BQ,65,FALSE),\"\")","v":""},{"$f":"IFERROR(VLOOKUP($M88,'Emission factors'!$C:$BQ,67,FALSE),\"\")","v":""},null,null,null,null,null,null,{"$f":"IFERROR(IF(AND($M88=\"\",$T88=\"\"),\"\",IF($M88=\"\",IF(U88=0,\"-\",U88),IF(O88=0,\"0\",$G88*IF($K88=\"\",1,$K88)*O88))),\"-\")","v":""},"","",{"$f":"IFERROR(IF(AND($M88=\"\",$T88=\"\"),\"\",IF($M88=\"\",IF(X88=\"\",SUM(U88:W88),IF(X88=0,\"0\",X88)),IF($R88=\"\",SUM($Z88:$AB88),IF($R88=0,\"0\",$G88*IF($K88=\"\",1,$K88)*$R88)))),\"-\")","v":""},{"$f":"IFERROR(IF(AND($M88=\"\",$T88=\"\"),\"\",IF($M88=\"\",IF(Y88=0,\"-\",Y88),IF(S88=0,\"0\",$G88*IF($K88=\"\",1,$K88)*S88))),\"-\")","v":""}]
[null,"I.5.3",3,null,null,null,null,null,null,null,null,null,null,{"$f":"IFERROR(CONCATENATE(\"tCO2e/\",VLOOKUP($M89,'Emission factors'!$C:$H,6,FALSE)),\"\")","v":""},{"$f":"IFERROR(VLOOKUP($M89,'Emission factors'!$C:$BQ,9,FALSE),\"\")","v":""},{"$f":"IFERROR(VLOOKUP($M89,'Emission factors'!$C:$BQ,12,FALSE),\"\")","v":""},{"$f":"IFERROR(VLOOKUP($M89,'Emission factors'!$C:$BQ,15,FALSE),\"\")","v":""},{"$f":"IFERROR(VLOOKUP($M89,'Emission factors'!$C:$BQ,65,FALSE),\"\")","v":""},{"$f":"IFERROR(VLOOKUP($M89,'Emission factors'!$C:$BQ,67,FALSE),\"\")","v":""},null,null,null,null,null,null,"","","",{"$f":"IFERROR(IF(AND($M89=\"\",$T89=\"\"),\"\",IF($M89=\"\",IF(X89=\"\",SUM(U89:W89),IF(X89=0,\"0\",X89)),IF($R89=\"\",SUM($Z89:$AB89),IF($R89=0,\"0\",$G89*IF($K89=\"\",1,$K89)*$R89)))),\"-\")","v":""},{"$f":"IFERROR(IF(AND($M89=\"\",$T89=\"\"),\"\",IF($M89=\"\",IF(Y89=0,\"-\",Y89),IF(S89=0,\"0\",$G89*IF($K89=\"\",1,$K89)*S89))),\"-\")","v":""}]
[]
[null,"I.6 NON-SPECIFIED SOURCES"]
[]
[null,"GPC ref No.","Scope","GHG Emissions Source",null,"Notation \nkeys","Activity data",null,"Activity data multiplier",null,null,"Gas(es)","Emission factor","Emission factor",null,null,null,null,null,"Emissions data","GHGs (metric tonnes CO2e)",null,null,null,null,"GHGs (metric tonnes CO2e)",null,null,null,null,"Data Quality",null,"Description of method(s) used or explanation for using notation key(s)","Source","Data quality explanation (optional)"]
[null,null,null,"Activity","Description",null,"Amount","Units","From","To","Factor",null,null,"Units","CO2","CH4","N2O","Total tCO2e","CO2(b)",null,"CO2","CH4","N2O","Total tCO2e","CO2(b)","CO2","CH4","N2O","Total tCO2e","CO2(b)","AD","EF"]
[null,"I.6.1",1,"Emissions from fuel combustion within the city boundary",null,"NO",null,null,null,null,null,null,null,null,null,null,null,null,null,null,null,null,null,null,null,null,null,null,null,null,null,null,"I.6.1 does not occur; no non-specified sources identified within the city boundary"]
[null,"I.6.1",1,null,null,null,null,null,null,null,null,null,null,{"$f":"IFERROR(CONCATENATE(\"tCO2e/\",VLOOKUP($M96,'Emission factors'!$C:$H,6,FALSE)),\"\")","v":""},{"$f":"IFERROR(VLOOKUP($M96,'Emission factors'!$C:$BQ,9,FALSE),\"\")","v":""},{"$f":"IFERROR(VLOOKUP($M96,'Emission factors'!$C:$BQ,12,FALSE),\"\")","v":""},{"$f":"IFERROR(VLOOKUP($M96,'Emission factors'!$C:$BQ,15,FALSE),\"\")","v":""},{"$f":"IFERROR(VLOOKUP($M96,'Emission factors'!$C:$BQ,65,FALSE),\"\")","v":""},{"$f":"IFERROR(VLOOKUP($M96,'Emission factors'!$C:$BQ,67,FALSE),\"\")","v":""},null,null,null,null,null,null,{"$f":"IFERROR(IF(AND($M96=\"\",$T96=\"\"),\"\",IF($M96=\"\",IF(U96=0,\"-\",U96),IF(O96=0,\"0\",$G96*IF($K96=\"\",1,$K96)*O96))),\"-\")","v":""},"","",{"$f":"IFERROR(IF(AND($M96=\"\",$T96=\"\"),\"\",IF($M96=\"\",IF(X96=\"\",SUM(U96:W96),IF(X96=0,\"0\",X96)),IF($R96=\"\",SUM($Z96:$AB96),IF($R96=0,\"0\",$G96*IF($K96=\"\",1,$K96)*$R96)))),\"-\")","v":""},{"$f":"IFERROR(IF(AND($M96=\"\",$T96=\"\"),\"\",IF($M96=\"\",IF(Y96=0,\"-\",Y96),IF(S96=0,\"0\",$G96*IF($K96=\"\",1,$K96)*S96))),\"-\")","v":""}]
[null,"I.6.1",1,null,null,null,null,null,null,null,null,null,null,{"$f":"IFERROR(CONCATENATE(\"tCO2e/\",VLOOKUP($M97,'Emission factors'!$C:$H,6,FALSE)),\"\")","v":""},{"$f":"IFERROR(VLOOKUP($M97,'Emission factors'!$C:$BQ,9,FALSE),\"\")","v":""},{"$f":"IFERROR(VLOOKUP($M97,'Emission factors'!$C:$BQ,12,FALSE),\"\")","v":""},{"$f":"IFERROR(VLOOKUP($M97,'Emission factors'!$C:$BQ,15,FALSE),\"\")","v":""},{"$f":"IFERROR(VLOOKUP($M97,'Emission factors'!$C:$BQ,65,FALSE),\"\")","v":""},{"$f":"IFERROR(VLOOKUP($M97,'Emission factors'!$C:$BQ,67,FALSE),\"\")","v":""},null,null,null,null,null,null,"","","",{"$f":"IFERROR(IF(AND($M97=\"\",$T97=\"\"),\"\",IF($M97=\"\",IF(X97=\"\",SUM(U97:W97),IF(X97=0,\"0\",X97)),IF($R97=\"\",SUM($Z97:$AB97),IF($R97=0,\"0\",$G97*IF($K97=\"\",1,$K97)*$R97)))),\"-\")","v":""},{"$f":"IFERROR(IF(AND($M97=\"\",$T97=\"\"),\"\",IF($M97=\"\",IF(Y97=0,\"-\",Y97),IF(S97=0,\"0\",$G97*IF($K97=\"\",1,$K97)*S97))),\"-\")","v":""}]
[null,"I.6.2",2,"Emissions from grid-supplied energy consumed within the city boundary",null,"NO",null,null,null,null,null,null,null,null,null,null,null,null,null,null,null,null,null,null,null,null,null,null,null,null,null,null,"I.6.2 does not occur; no non-specified sources identified within the city boundary"]
[null,"I.6.2",2,null,null,null,null,null,null,null,null,null,null,{"$f":"IFERROR(CONCATENATE(\"tCO2e/\",VLOOKUP($M99,'Emission factors'!$C:$H,6,FALSE)),\"\")","v":""},{"$f":"IFERROR(VLOOKUP($M99,'Emission factors'!$C:$BQ,9,FALSE),\"\")","v":""},{"$f":"IFERROR(VLOOKUP($M99,'Emission factors'!$C:$BQ,12,FALSE),\"\")","v":""},{"$f":"IFERROR(VLOOKUP($M99,'Emission factors'!$C:$BQ,15,FALSE),\"\")","v":""},{"$f":"IFERROR(VLOOKUP($M99,'Emission factors'!$C:$BQ,65,FALSE),\"\")","v":""},{"$f":"IFERROR(VLOOKUP($M99,'Emission factors'!$C:$BQ,67,FALSE),\"\")","v":""},null,null,null,null,null,null,{"$f":"IFERROR(IF(AND($M99=\"\",$T99=\"\"),\"\",IF($M99=\"\",IF(U99=0,\"-\",U99),IF(O99=0,\"0\",$G99*IF($K99=\"\",1,$K99)*O99))),\"-\")","v":""},"","",{"$f":"IFERROR(IF(AND($M99=\"\",$T99=\"\"),\"\",IF($M99=\"\",IF(X99=\"\",SUM(U99:W99),IF(X99=0,\"0\",X99)),IF($R99=\"\",SUM($Z99:$AB99),IF($R99=0,\"0\",$G99*IF($K99=\"\",1,$K99)*$R99)))),\"-\")","v":""},{"$f":"IFERROR(IF(AND($M99=\"\",$T99=\"\"),\"\",IF($M99=\"\",IF(Y99=0,\"-\",Y99),IF(S99=0,\"0\",$G99*IF($K99=\"\",1,$K99)*S99))),\"-\")","v":""}]
[null,"I.6.2",2,null,null,null,null,null,null,null,null,null,null,{"$f":"IFERROR(CONCATENATE(\"tCO2e/\",VLOOKUP($M100,'Emission factors'!$C:$H,6,FALSE)),\"\")","v":""},{"$f":"IFERROR(VLOOKUP($M100,'Emission factors'!$C:$BQ,9,FALSE),\"\")","v":""},{"$f":"IFERROR(VLOOKUP($M100,'Emission factors'!$C:$BQ,12,FALSE),\"\")","v":""},{"$f":"IFERROR(VLOOKUP($M100,'Emission factors'!$C:$BQ,15,FALSE),\"\")","v":""},{"$f":"IFERROR(VLOOKUP($M100,'Emission factors'!$C:$BQ,65,FALSE),\"\")","v":""},{"$f":"IFERROR(VLOOKUP($M100,'Emission factors'!$C:$BQ,67,FALSE),\"\")","v":""},null,null,null,null,null,null,"","","",{"$f":"IFERROR(IF(AND($M100=\"\",$T100=\"\"),\"\",IF($M100=\"\",IF(X100=\"\",SUM(U100:W100),IF(X100=0,\"0\",X100)),IF($R100=\"\",SUM($Z100:$AB100),IF($R100=0,\"0\",$G100*IF($K100=\"\",1,$K100)*$R100)))),\"-\")","v":""},{"$f":"IFERROR(IF(AND($M100=\"\",$T100=\"\"),\"\",IF($M100=\"\",IF(Y100=0,\"-\",Y100),IF(S100=0,\"0\",$G100*IF($K100=\"\",1,$K100)*S100))),\"-\")","v":""}]
[null,"I.6.3",3,"Emissions from transmission and distribution losses from grid-supplied energy consumption",null,"NO",null,null,null,null,null,null,null,null,null,null,null,null,null,null,null,null,null,null,null,null,null,null,null,null,null,null,"I.6.3 does not occur; no non-specified sources identified within the city boundary"]
[null,"I.6.3",3,null,null,null,null,null,null,null,null,null,null,{"$f":"IFERROR(CONCATENATE(\"tCO2e/\",VLOOKUP($M102,'Emission factors'!$C:$H,6,FALSE)),\"\")","v":""},{"$f":"IFERROR(VLOOKUP($M102,'Emission factors'!$C:$BQ,9,FALSE),\"\")","v":""},{"$f":"IFERROR(VLOOKUP($M102,'Emission factors'!$C:$BQ,12,FALSE),\"\")","v":""},{"$f":"IFERROR(VLOOKUP($M102,'Emission factors'!$C:$BQ,15,FALSE),\"\")","v":""},{"$f":"IFERROR(VLOOKUP($M102,'Emission factors'!$C:$BQ,65,FALSE),\"\")","v":""},{"$f":"IFERROR(VLOOKUP($M102,'Emission factors'!$C:$BQ,67,FALSE),\"\")","v":""},null,null,null,null,null,null,{"$f":"IFERROR(IF(AND($M102=\"\",$T102=\"\"),\"\",IF($M102=\"\",IF(U102=0,\"-\",U102),IF(O102=0,\"0\",$G102*IF($K102=\"\",1,$K102)*O102))),\"-\")","v":""},"","",{"$f":"IFERROR(IF(AND($M102=\"\",$T102=\"\"),\"\",IF($M102=\"\",IF(X102=\"\",SUM(U102:W102),IF(X102=0,\"0\",X102)),IF($R102=\"\",SUM($Z102:$AB102),IF($R102=0,\"0\",$G102*IF($K102=\"\",1,$K102)*$R102)))),\"-\")","v":""},{"$f":"IFERROR(IF(AND($M102=\"\",$T102=\"\"),\"\",IF($M102=\"\",IF(Y102=0,\"-\",Y102),IF(S102=0,\"0\",$G102*IF($K102=\"\",1,$K102)*S102))),\"-\")","v":""}]
[null,"I.6.3",3,null,null,null,null,null,null,null,null,null,null,{"$f":"IFERROR(CONCATENATE(\"tCO2e/\",VLOOKUP($M103,'Emission factors'!$C:$H,6,FALSE)),\"\")","v":""},{"$f":"IFERROR(VLOOKUP($M103,'Emission factors'!$C:$BQ,9,FALSE),\"\")","v":""},{"$f":"IFERROR(VLOOKUP($M103,'Emission factors'!$C:$BQ,12,FALSE),\"\")","v":""},{"$f":"IFERROR(VLOOKUP($M103,'Emission factors'!$C:$BQ,15,FALSE),\"\")","v":""},{"$f":"IFERROR(VLOOKUP($M103,'Emission factors'!$C:$BQ,65,FALSE),\"\")","v":""},{"$f":"IFERROR(VLOOKUP($M103,'Emission factors'!$C:$BQ,67,FALSE),\"\")","v":""},null,null,null,null,null,null,"","","",{"$f":"IFERROR(IF(AND($M103=\"\",$T103=\"\"),\"\",IF($M103=\"\",IF(X103=\"\",SUM(U103:W103),IF(X103=0,\"0\",X103)),IF($R103=\"\",SUM($Z103:$AB103),IF($R103=0,\"0\",$G103*IF($K103=\"\",1,$K103)*$R103)))),\"-\")","v":""},{"$f":"IFERROR(IF(AND($M103=\"\",$T103=\"\"),\"\",IF($M103=\"\",IF(Y103=0,\"-\",Y103),IF(S103=0,\"0\",$G103*IF($K103=\"\",1,$K103)*S103))),\"-\")","v":""}]
[]
[null,"I.7 FUGITIVE EMISSIONS FROM MINING, PROCESSING, STORAGE AND TRANSPORTATION OF COAL"]
[]
[null,"GPC ref No.","Scope","GHG Emissions Source",null,"Notation \nkeys","Activity data",null,"Activity data multiplier",null,null,"Gas(es)","Emission factor","Emission factor",null,null,null,null,null,"Emissions data","GHGs (metric tonnes CO2e)",null,null,null,null,"GHGs (metric tonnes CO2e)",null,null,null,null,"Data Quality",null,"Description of method(s) used or explanation for using notation key(s)","Source","Data quality explanation (optional)"]
[null,null,null,"Activity","Description",null,"Amount","Units","From","To","Factor",null,null,"Units","CO2","CH4","N2O","Total tCO2e","CO2(b)",null,"CO2","CH4","N2O","Total tCO2e","CO2(b)","CO2","CH4","N2O","Total tCO2e","CO2(b)","AD","EF"]
[null,"I.7.1",1,"Emissions from fugitive emissions within the city boundary",null,"NO",null,null,null,null,null,null,null,null,null,null,null,null,null,null,null,null,null,null,null,null,null,null,null,null,null,null,"I.7.1 does not occur; no coal-related activities within the city boundary"]
[null,"I.7.1",1,null,null,null,null,null,null,null,null,null,null,{"$f":"IFERROR(CONCATENATE(\"tCO2e/\",VLOOKUP($M110,'Emission factors'!$C:$H,6,FALSE)),\"\")","v":""},{"$f":"IFERROR(VLOOKUP($M110,'Emission factors'!$C:$BQ,9,FALSE),\"\")","v":""},{"$f":"IFERROR(VLOOKUP($M110,'Emission factors'!$C:$BQ,12,FALSE),\"\")","v":""},{"$f":"IFERROR(VLOOKUP($M110,'Emission factors'!$C:$BQ,15,FALSE),\"\")","v":""},{"$f":"IFERROR(VLOOKUP($M110,'Emission factors'!$C:$BQ,65,FALSE),\"\")","v":""},{"$f":"IFERROR(VLOOKUP($M110,'Emission factors'!$C:$BQ,67,FALSE),\"\")","v":""},null,null,null,null,null,null,{"$f":"IFERROR(IF(AND($M110=\"\",$T110=\"\"),\"\",IF($M110=\"\",IF(U110=0,\"-\",U110),IF(O110=0,\"0\",$G110*IF($K110=\"\",1,$K110)*O110))),\"-\")","v":""},"","",{"$f":"IFERROR(IF(AND($M110=\"\",$T110=\"\"),\"\",IF($M110=\"\",IF(X110=\"\",SUM(U110:W110),IF(X110=0,\"0\",X110)),IF($R110=\"\",SUM($Z110:$AB110),IF($R110=0,\"0\",$G110*IF($K110=\"\",1,$K110)*$R110)))),\"-\")","v":""},{"$f":"IFERROR(IF(AND($M110=\"\",$T110=\"\"),\"\",IF($M110=\"\",IF(Y110=0,\"-\",Y110),IF(S110=0,\"0\",$G110*IF($K110=\"\",1,$K110)*S110))),\"-\")","v":""}]
[null,"I.7.1",1,null,null,null,null,null,null,null,null,null,null,{"$f":"IFERROR(CONCATENATE(\"tCO2e/\",VLOOKUP($M111,'Emission factors'!$C:$H,6,FALSE)),\"\")","v":""},{"$f":"IFERROR(VLOOKUP($M111,'Emission factors'!$C:$BQ,9,FALSE),\"\")","v":""},{"$f":"IFERROR(VLOOKUP($M111,'Emission factors'!$C:$BQ,12,FALSE),\"\")","v":""},{"$f":"IFERROR(VLOOKUP($M111,'Emission factors'!$C:$BQ,15,FALSE),\"\")","v":""},{"$f":"IFERROR(VLOOKUP($M111,'Emission factors'!$C:$BQ,65,FALSE),\"\")","v":""},{"$f":"IFERROR(VLOOKUP($M111,'Emission factors'!$C:$BQ,67,FALSE),\"\")","v":""},null,null,null,null,null,null,"","","",{"$f":"IFERROR(IF(AND($M111=\"\",$T111=\"\"),\"\",IF($M111=\"\",IF(X111=\"\",SUM(U111:W111),IF(X111=0,\"0\",X111)),IF($R111=\"\",SUM($Z111:$AB111),IF($R111=0,\"0\",$G111*IF($K111=\"\",1,$K111)*$R111)))),\"-\")","v":""},{"$f":"IFERROR(IF(AND($M111=\"\",$T111=\"\"),\"\",IF($M111=\"\",IF(Y111=0,\"-\",Y111),IF(S111=0,\"0\",$G111*IF($K111=\"\",1,$K111)*S111))),\"-\")","v":""}]
[]
[null,"I.8 FUGITIVE EMISSIONS FROM OIL AND NATURAL GAS SYSTEMS"]
[]
[null,"GPC ref No.","Scope","GHG Emissions Source",null,"Notation \nkeys","Activity data",null,"Activity data multiplier",null,null,"Gas(es)","Emission factor","Emission factor",null,null,null,null,null,"Emissions data","GHGs (metric tonnes CO2e)",null,null,null,null,"GHGs (metric tonnes CO2e)",null,null,null,null,"Data Quality",null,"Description of method(s) used or explanation for using notation key(s)","Source","Data quality explanation (optional)"]
[null,null,null,"Activity","Description",null,"Amount","Units","From","To","Factor",null,null,"Units","CO2","CH4","N2O","Total tCO2e","CO2(b)",null,"CO2","CH4","N2O","Total tCO2e","CO2(b)","CO2","CH4","N2O","Total tCO2e","CO2(b)","AD","EF"]
[null,"I.8.1",1,"Emissions from fugitive emissions within the city boundary",null,"NE",null,null,null,null,null,null,null,null,null,null,null,null,null,null,null,null,null,null,null,null,null,null,null,null,null,null,"I.8.1 have not been estimated"]
[null,"I.8.1",1,null,null,null,null,null,null,null,null,null,null,{"$f":"IFERROR(CONCATENATE(\"tCO2e/\",VLOOKUP($M118,'Emission factors'!$C:$H,6,FALSE)),\"\")","v":""},{"$f":"IFERROR(VLOOKUP($M118,'Emission factors'!$C:$BQ,9,FALSE),\"\")","v":""},{"$f":"IFERROR(VLOOKUP($M118,'Emission factors'!$C:$BQ,12,FALSE),\"\")","v":""},{"$f":"IFERROR(VLOOKUP($M118,'Emission factors'!$C:$BQ,15,FALSE),\"\")","v":""},{"$f":"IFERROR(VLOOKUP($M118,'Emission factors'!$C:$BQ,65,FALSE),\"\")","v":""},{"$f":"IFERROR(VLOOKUP($M118,'Emission factors'!$C:$BQ,67,FALSE),\"\")","v":""},null,null,null,null,null,null,{"$f":"IFERROR(IF(AND($M118=\"\",$T118=\"\"),\"\",IF($M118=\"\",IF(U118=0,\"-\",U118),IF(O118=0,\"0\",$G118*IF($K118=\"\",1,$K118)*O118))),\"-\")","v":""},"","",{"$f":"IFERROR(IF(AND($M118=\"\",$T118=\"\"),\"\",IF($M118=\"\",IF(X118=\"\",SUM(U118:W118),IF(X118=0,\"0\",X118)),IF($R118=\"\",SUM($Z118:$AB118),IF($R118=0,\"0\",$G118*IF($K118=\"\",1,$K118)*$R118)))),\"-\")","v":""},{"$f":"IFERROR(IF(AND($M118=\"\",$T118=\"\"),\"\",IF($M118=\"\",IF(Y118=0,\"-\",Y118),IF(S118=0,\"0\",$G118*IF($K118=\"\",1,$K118)*S118))),\"-\")","v":""}]
[null,"I.8.1",1,null,null,null,null,null,null,null,null,null,null,{"$f":"IFERROR(CONCATENATE(\"tCO2e/\",VLOOKUP($M119,'Emission factors'!$C:$H,6,FALSE)),\"\")","v":""},{"$f":"IFERROR(VLOOKUP($M119,'Emission factors'!$C:$BQ,9,FALSE),\"\")","v":""},{"$f":"IFERROR(VLOOKUP($M119,'Emission factors'!$C:$BQ,12,FALSE),\"\")","v":""},{"$f":"IFERROR(VLOOKUP($M119,'Emission factors'!$C:$BQ,15,FALSE),\"\")","v":""},{"$f":"IFERROR(VLOOKUP($M119,'Emission factors'!$C:$BQ,65,FALSE),\"\")","v":""},{"$f":"IFERROR(VLOOKUP($M119,'Emission factors'!$C:$BQ,67,FALSE),\"\")","v":""},null,null,null,null,null,null,"","","",{"$f":"IFERROR(IF(AND($M119=\"\",$T119=\"\"),\"\",IF($M119=\"\",IF(X119=\"\",SUM(U119:W119),IF(X119=0,\"0\",X119)),IF($R119=\"\",SUM($Z119:$AB119),IF($R119=0,\"0\",$G119*IF($K119=\"\",1,$K119)*$R119)))),\"-\")","v":""},{"$f":"IFERROR(IF(AND($M119=\"\",$T119=\"\"),\"\",IF($M119=\"\",IF(Y119=0,\"-\",Y119),IF(S119=0,\"0\",$G119*IF($K119=\"\",1,$K119)*S119))),\"-\")","v":""}]
[]
[null,"I. MACRO"]

{"sheet":"II - Transport","index":6,"n_rows":97,"n_cols":36,"rows_kept":97,"cut":false,"hidden":false,"merged":[[84,26,84,30],[84,31,84,32],[84,33,85,33],[42,26,42,30],[42,31,42,32],[70,26,70,30],[70,31,70,32],[56,26,56,30],[42,33,43,33],[56,31,56,32],[56,33,57,33],[84,34,85,34],[84,35,85,35],[7,35,8,35],[42,34,43,34],[42,35,43,35],[56,34,57,34],[56,35,57,35],[7,34,8,34],[70,34,71,34],[7,1,8,1],[7,2,8,2],[7,6,8,6],[7,26,7,30],[7,3,7,5],[7,13,8,13],[7,12,8,12],[7,14,7,19],[7,20,8,20],[7,21,7,25],[56,1,57,1],[56,2,57,2],[56,3,56,5],[56,6,57,6],[56,7,56,8],[42,1,43,1],[42,2,43,2],[42,3,42,5],[42,6,43,6],[42,7,42,8],[70,1,71,1],[70,2,71,2],[70,3,70,5],[70,6,71,6],[70,7,70,8],[84,1,85,1],[84,2,85,2],[84,3,84,5],[84,6,85,6],[84,7,84,8],[1,34,1,35],[3,34,4,35],[42,12,43,12],[56,12,57,12],[70,12,71,12],[42,13,43,13],[56,13,57,13],[70,13,71,13],[70,33,71,33],[42,20,43,20],[56,20,57,20],[70,20,71,20],[7,33,8,33],[7,31,7,32],[70,35,71,35],[42,21,42,25],[1,7,1,8],[3,7,4,8],[3,13,4,13],[3,20,4,20],[84,12,85,12],[7,9,7,11],[84,13,85,13],[7,7,7,8],[42,14,42,19],[56,14,56,19],[42,9,42,11],[56,9,56,11],[70,9,70,11],[84,9,84,11],[56,21,56,25],[70,14,70,19],[70,21,70,25],[84,14,84,19],[84,21,84,25],[84,20,85,20]]}
[]
[null,"II TRANSPORTATION",null,null,null,null,null,"",null,null,null,null,null,"",null,null,null,null,null,null,"",null,null,null,null,null,null,null,null,null,null,null,null,null,""]
[]
[null,"Use this tab to record activity and emissions data for Transportation sources. Emission factors should be recorded in the 'Emission factors' tab.",null,null,null,null,null,"Convert activity data units",null,null,null,null,null,"View emission factor(s)",null,null,null,null,null,null,"Enter emissions data",null,null,null,null,null,null,null,null,null,null,null,null,null,"Data quality explanation (optional)"]
[]
[null,"II.1 ON-ROAD TRANSPORTATION"]
[]
[null,"GPC ref No.","Scope","GHG Emissions Source",null,null,"Notation \nkeys","Activity data",null,"Activity data multiplier",null,null,"Gas(es)","Emission factor","Emission factor",null,null,null,null,null,"Emissions data","GHGs (metric tonnes CO2e)",null,null,null,null,"GHGs (metric tonnes CO2e)",null,null,null,null,"Data Quality",null,"Description of method(s) used or explanation for using notation key(s)","Source","Data quality explanation (optional)"]
[null,null,null,"Method","Activity","Description",null,"Amount","Units","From","To","Factor",null,null,"Units","CO2","CH4","N2O","Total tCO2e","CO2(b)",null,"CO2","CH4","N2O","Total tCO2e","CO2(b)","CO2","CH4","N2O","Total tCO2e","CO2(b)","AD","EF"]
[null,"II.1.1",1,"Emissions from fuel combustion on-road transportation occurring in the city"]
[null,"II.1.1",1,"Geographic / Territorial","Motor gasoline (petrol)","Motorcycle",null,{"$f":"'[3]VMT from Client'!$L4","v":65309817.792204402},"VMT",null,null,null,"CO2, CH4, N2O","EF_motorcycle",{"$f":"IFERROR(CONCATENATE(\"tCO2e/\",VLOOKUP($N11,'Emission factors'!$C:$I,6,FALSE)),\"\")","v":"tCO2e/mile"},{"$f":"IFERROR(VLOOKUP($N11,'Emission factors'!$C:$BQ,9,FALSE),\"\")","v":""},{"$f":"IFERROR(VLOOKUP($N11,'Emission factors'!$C:$BQ,12,FALSE),\"\")","v":""},{"$f":"IFERROR(VLOOKUP($N11,'Emission factors'!$C:$BQ,15,FALSE),\"\")","v":""},{"$f":"IFERROR(VLOOKUP($N11,'Emission factors'!$C:$BQ,65,FALSE),\"\")","v":3.7646988517695391E-4},{"$f":"IFERROR(VLOOKUP($N11,'Emission factors'!$C:$BQ,67,FALSE),\"\")","v":""},null,null,null,null,null,null,{"$f":"IFERROR(IF(AND($N11=\"\",$U11=\"\"),\"\",IF($N11=\"\",IF(V11=0,\"-\",V11),IF(P11=0,\"0\",$H11*IF($L11=\"\",1,$L11)*P11))),\"-\")","v":"-"},"-","-",{"$f":"IFERROR(IF(AND($N11=\"\",$U11=\"\"),\"\",IF($N11=\"\",IF(Y11=\"\",SUM(AA11:AC11),IF(Y11=0,\"0\",Y11)),IF($S11=\"\",SUM($AA11:$AC11),IF($S11=0,\"0\",$H11*IF($L11=\"\",1,$L11)*$S11)))),\"-\")","v":24587.179605158974},{"$f":"IFERROR(IF(AND($N11=\"\",$U11=\"\"),\"\",IF($N11=\"\",IF(Z11=0,\"\",Z11),IF(T11=0,\"0\",$H11*IF($L11=\"\",1,$L11)*T11))),\"-\")","v":"-"}]
[null,"II.1.1",1,"Geographic / Territorial","Motor gasoline (petrol)","Passenger car",null,{"$f":"'[3]VMT from Client'!$L5","v":4453333652.3952951},"VMT",null,null,null,"CO2, CH4, N2O","EF_passenger car - gasoline",{"$f":"IFERROR(CONCATENATE(\"tCO2e/\",VLOOKUP($N12,'Emission factors'!$C:$I,6,FALSE)),\"\")","v":"tCO2e/mile"},{"$f":"IFERROR(VLOOKUP($N12,'Emission factors'!$C:$BQ,9,FALSE),\"\")","v":""},{"$f":"IFERROR(VLOOKUP($N12,'Emission factors'!$C:$BQ,12,FALSE),\"\")","v":""},{"$f":"IFERROR(VLOOKUP($N12,'Emission factors'!$C:$BQ,15,FALSE),\"\")","v":""},{"$f":"IFERROR(VLOOKUP($N12,'Emission factors'!$C:$BQ,65,FALSE),\"\")","v":3.8026687123177778E-4},{"$f":"IFERROR(VLOOKUP($N12,'Emission factors'!$C:$BQ,67,FALSE),\"\")","v":""},null,null,null,null,null,null,{"$f":"IFERROR(IF(AND($N12=\"\",$U12=\"\"),\"\",IF($N12=\"\",IF(V12=0,\"-\",V12),IF(P12=0,\"0\",$H12*IF($L12=\"\",1,$L12)*P12))),\"-\")","v":"-"},{"$f":"IFERROR(IF(AND($N12=\"\",$U12=\"\"),\"\",IF($N12=\"\",IF(W12=0,\"-\",W12),IF(Q12=0,\"0\",$H12*IF($L12=\"\",1,$L12)*Q12))),\"-\")","v":"-"},{"$f":"IFERROR(IF(AND($N12=\"\",$U12=\"\"),\"\",IF($N12=\"\",IF(X12=0,\"-\",X12),IF(R12=0,\"0\",$H12*IF($L12=\"\",1,$L12)*R12))),\"-\")","v":"-"},{"$f":"IFERROR(IF(AND($N12=\"\",$U12=\"\"),\"\",IF($N12=\"\",IF(Y12=\"\",SUM(AA12:AC12),IF(Y12=0,\"0\",Y12)),IF($S12=\"\",SUM($AA12:$AC12),IF($S12=0,\"0\",$H12*IF($L12=\"\",1,$L12)*$S12)))),\"-\")","v":1693455.2545475443},{"$f":"IFERROR(IF(AND($N12=\"\",$U12=\"\"),\"\",IF($N12=\"\",IF(Z12=0,\"\",Z12),IF(T12=0,\"0\",$H12*IF($L12=\"\",1,$L12)*T12))),\"-\")","v":"-"}]
[null,"II.1.1",1,"Geographic / Territorial","Motor gasoline (petrol)","Passenger truck",null,{"$f":"'[3]VMT from Client'!$L6","v":5154090966.2998199},"VMT",null,null,null,"CO2, CH4, N2O","EF_passenger truck - gasoline",{"$f":"IFERROR(CONCATENATE(\"tCO2e/\",VLOOKUP($N13,'Emission factors'!$C:$I,6,FALSE)),\"\")","v":"tCO2e/mile"},{"$f":"IFERROR(VLOOKUP($N13,'Emission factors'!$C:$BQ,9,FALSE),\"\")","v":""},{"$f":"IFERROR(VLOOKUP($N13,'Emission factors'!$C:$BQ,12,FALSE),\"\")","v":""},{"$f":"IFERROR(VLOOKUP($N13,'Emission factors'!$C:$BQ,15,FALSE),\"\")","v":""},{"$f":"IFERROR(VLOOKUP($N13,'Emission factors'!$C:$BQ,65,FALSE),\"\")","v":5.2784500669770553E-4},{"$f":"IFERROR(VLOOKUP($N13,'Emission factors'!$C:$BQ,67,FALSE),\"\")","v":""},null,null,null,null,null,null,"-","-","-",2720561.1806271118,"-"]
[null,"II.1.1",1,"Geographic / Territorial","Motor gasoline (petrol)","Light commercial truck",null,{"$f":"'[3]VMT from Client'!$L7","v":1483891722.1955612},"VMT",null,null,null,"CO2, CH4, N2O","EF_light commercial truck - gasoline",{"$f":"IFERROR(CONCATENATE(\"tCO2e/\",VLOOKUP($N14,'Emission factors'!$C:$I,6,FALSE)),\"\")","v":"tCO2e/mile"},{"$f":"IFERROR(VLOOKUP($N14,'Emission factors'!$C:$BQ,9,FALSE),\"\")","v":""},{"$f":"IFERROR(VLOOKUP($N14,'Emission factors'!$C:$BQ,12,FALSE),\"\")","v":""},{"$f":"IFERROR(VLOOKUP($N14,'Emission factors'!$C:$BQ,15,FALSE),\"\")","v":""},{"$f":"IFERROR(VLOOKUP($N14,'Emission factors'!$C:$BQ,65,FALSE),\"\")","v":5.2101804988662125E-4},{"$f":"IFERROR(VLOOKUP($N14,'Emission factors'!$C:$BQ,67,FALSE),\"\")","v":""},null,null,null,null,null,null,"-","-","-",773134.37134123116,"-"]
[null,"II.1.1",1,"Geographic / Territorial","Motor gasoline (petrol)","School bus",null,{"$f":"'[3]VMT from Client'!$L$10","v":1042257.5113848469},"VMT",null,null,null,"CO2, CH4, N2O","EF_school bus - gasoline",{"$f":"IFERROR(CONCATENATE(\"tCO2e/\",VLOOKUP($N15,'Emission factors'!$C:$I,6,FALSE)),\"\")","v":"tCO2e/mile"},{"$f":"IFERROR(VLOOKUP($N15,'Emission factors'!$C:$BQ,9,FALSE),\"\")","v":""},{"$f":"IFERROR(VLOOKUP($N15,'Emission factors'!$C:$BQ,12,FALSE),\"\")","v":""},{"$f":"IFERROR(VLOOKUP($N15,'Emission factors'!$C:$BQ,15,FALSE),\"\")","v":""},{"$f":"IFERROR(VLOOKUP($N15,'Emission factors'!$C:$BQ,65,FALSE),\"\")","v":8.819313713336243E-4},{"$f":"IFERROR(VLOOKUP($N15,'Emission factors'!$C:$BQ,67,FALSE),\"\")","v":""},null,null,null,null,null,null,"-","-","-",919.19959629840855,"-"]
[null,"II.1.1",1,"Geographic / Territorial","Motor gasoline (petrol)","Single unit short-haul truck",null,{"$f":"'[3]VMT from Client'!$L12","v":18051498.167728055},"VMT",null,null,null,"CO2, CH4, N2O","EF_single unit short haul truck - gasoline",{"$f":"IFERROR(CONCATENATE(\"tCO2e/\",VLOOKUP($N16,'Emission factors'!$C:$I,6,FALSE)),\"\")","v":"tCO2e/mile"},{"$f":"IFERROR(VLOOKUP($N16,'Emission factors'!$C:$BQ,9,FALSE),\"\")","v":""},{"$f":"IFERROR(VLOOKUP($N16,'Emission factors'!$C:$BQ,12,FALSE),\"\")","v":""},{"$f":"IFERROR(VLOOKUP($N16,'Emission factors'!$C:$BQ,15,FALSE),\"\")","v":""},{"$f":"IFERROR(VLOOKUP($N16,'Emission factors'!$C:$BQ,65,FALSE),\"\")","v":1.0518240046968716E-3},{"$f":"IFERROR(VLOOKUP($N16,'Emission factors'!$C:$BQ,67,FALSE),\"\")","v":""},null,null,null,null,null,null,{"$f":"IFERROR(IF(AND($N16=\"\",$U16=\"\"),\"\",IF($N16=\"\",IF(V16=0,\"-\",V16),IF(P16=0,\"0\",$H16*IF($L16=\"\",1,$L16)*P16))),\"-\")","v":"-"},{"$f":"IFERROR(IF(AND($N16=\"\",$U16=\"\"),\"\",IF($N16=\"\",IF(W16=0,\"-\",W16),IF(Q16=0,\"0\",$H16*IF($L16=\"\",1,$L16)*Q16))),\"-\")","v":"-"},{"$f":"IFERROR(IF(AND($N16=\"\",$U16=\"\"),\"\",IF($N16=\"\",IF(X16=0,\"-\",X16),IF(R16=0,\"0\",$H16*IF($L16=\"\",1,$L16)*R16))),\"-\")","v":"-"},18986.999093557963,"-"]
[null,"II.1.1",1,"Geographic / Territorial","Motor gasoline (petrol)","Single unit long-haul truck",null,{"$f":"'[3]VMT from Client'!$L13","v":788142.56432436395},"VMT",null,null,null,"CO2, CH4, N2O","EF_single unit long-haul truck - gasoline",{"$f":"IFERROR(CONCATENATE(\"tCO2e/\",VLOOKUP($N17,'Emission factors'!$C:$I,6,FALSE)),\"\")","v":"tCO2e/mile"},{"$f":"IFERROR(VLOOKUP($N17,'Emission factors'!$C:$BQ,9,FALSE),\"\")","v":""},{"$f":"IFERROR(VLOOKUP($N17,'Emission factors'!$C:$BQ,12,FALSE),\"\")","v":""},{"$f":"IFERROR(VLOOKUP($N17,'Emission factors'!$C:$BQ,15,FALSE),\"\")","v":""},{"$f":"IFERROR(VLOOKUP($N17,'Emission factors'!$C:$BQ,65,FALSE),\"\")","v":9.8900305670725176E-4},{"$f":"IFERROR(VLOOKUP($N17,'Emission factors'!$C:$BQ,67,FALSE),\"\")","v":""},null,null,null,null,null,null,{"$f":"IFERROR(IF(AND($N17=\"\",$U17=\"\"),\"\",IF($N17=\"\",IF(V17=0,\"-\",V17),IF(P17=0,\"0\",$H17*IF($L17=\"\",1,$L17)*P17))),\"-\")","v":"-"},{"$f":"IFERROR(IF(AND($N17=\"\",$U17=\"\"),\"\",IF($N17=\"\",IF(W17=0,\"-\",W17),IF(Q17=0,\"0\",$H17*IF($L17=\"\",1,$L17)*Q17))),\"-\")","v":"-"},{"$f":"IFERROR(IF(AND($N17=\"\",$U17=\"\"),\"\",IF($N17=\"\",IF(X17=0,\"-\",X17),IF(R17=0,\"0\",$H17*IF($L17=\"\",1,$L17)*R17))),\"-\")","v":"-"},779.47540523788768,"-"]
[null,"II.1.1",1,"Geographic / Territorial","Motor gasoline (petrol)","Motor home",null,{"$f":"'[3]VMT from Client'!$L14","v":5992980.6904628705},"VMT",null,null,null,"CO2, CH4, N2O","EF_motor home - gasoline",{"$f":"IFERROR(CONCATENATE(\"tCO2e/\",VLOOKUP($N18,'Emission factors'!$C:$I,6,FALSE)),\"\")","v":"tCO2e/mile"},{"$f":"IFERROR(VLOOKUP($N18,'Emission factors'!$C:$BQ,9,FALSE),\"\")","v":""},{"$f":"IFERROR(VLOOKUP($N18,'Emission factors'!$C:$BQ,12,FALSE),\"\")","v":""},{"$f":"IFERROR(VLOOKUP($N18,'Emission factors'!$C:$BQ,15,FALSE),\"\")","v":""},{"$f":"IFERROR(VLOOKUP($N18,'Emission factors'!$C:$BQ,65,FALSE),\"\")","v":1.0557361471729334E-3},{"$f":"IFERROR(VLOOKUP($N18,'Emission factors'!$C:$BQ,67,FALSE),\"\")","v":""},null,null,null,null,null,null,{"$f":"IFERROR(IF(AND($N18=\"\",$U18=\"\"),\"\",IF($N18=\"\",IF(V18=0,\"-\",V18),IF(P18=0,\"0\",$H18*IF($L18=\"\",1,$L18)*P18))),\"-\")","v":"-"},{"$f":"IFERROR(IF(AND($N18=\"\",$U18=\"\"),\"\",IF($N18=\"\",IF(W18=0,\"-\",W18),IF(Q18=0,\"0\",$H18*IF($L18=\"\",1,$L18)*Q18))),\"-\")","v":"-"},{"$f":"IFERROR(IF(AND($N18=\"\",$U18=\"\"),\"\",IF($N18=\"\",IF(X18=0,\"-\",X18),IF(R18=0,\"0\",$H18*IF($L18=\"\",1,$L18)*R18))),\"-\")","v":"-"},6327.0063442310575,"-"]
[null,"II.1.1",1,"Geographic / Territorial","Motor gasoline (petrol)","Combination short-haul truck",null,{"$f":"'[3]VMT from Client'!$L15","v":262176.73554264393},"VMT",null,null,null,"CO2, CH4, N2O","EF_combination short-haul truck - gasoline",{"$f":"IFERROR(CONCATENATE(\"tCO2e/\",VLOOKUP($N19,'Emission factors'!$C:$I,6,FALSE)),\"\")","v":"tCO2e/mile"},{"$f":"IFERROR(VLOOKUP($N19,'Emission factors'!$C:$BQ,9,FALSE),\"\")","v":""},{"$f":"IFERROR(VLOOKUP($N19,'Emission factors'!$C:$BQ,12,FALSE),\"\")","v":""},{"$f":"IFERROR(VLOOKUP($N19,'Emission factors'!$C:$BQ,15,FALSE),\"\")","v":""},{"$f":"IFERROR(VLOOKUP($N19,'Emission factors'!$C:$BQ,65,FALSE),\"\")","v":2.0634997228983791E-3},{"$f":"IFERROR(VLOOKUP($N19,'Emission factors'!$C:$BQ,67,FALSE),\"\")","v":""},null,null,null,null,null,null,{"$f":"IFERROR(IF(AND($N19=\"\",$U19=\"\"),\"\",IF($N19=\"\",IF(V19=0,\"-\",V19),IF(P19=0,\"0\",$H19*IF($L19=\"\",1,$L19)*P19))),\"-\")","v":"-"},{"$f":"IFERROR(IF(AND($N19=\"\",$U19=\"\"),\"\",IF($N19=\"\",IF(W19=0,\"-\",W19),IF(Q19=0,\"0\",$H19*IF($L19=\"\",1,$L19)*Q19))),\"-\")","v":"-"},{"$f":"IFERROR(IF(AND($N19=\"\",$U19=\"\"),\"\",IF($N19=\"\",IF(X19=0,\"-\",X19),IF(R19=0,\"0\",$H19*IF($L19=\"\",1,$L19)*R19))),\"-\")","v":"-"},541.00162114264731,"-"]
[null,"II.1.1",1,"Geographic / Territorial","Diesel oil","Passenger car",null,{"$f":"'[3]VMT from Client'!$V5","v":4013430.2569457171},"VMT",null,null,null,"CO2, CH4, N2O","EF_passenger car - diesel",{"$f":"IFERROR(CONCATENATE(\"tCO2e/\",VLOOKUP($N20,'Emission factors'!$C:$I,6,FALSE)),\"\")","v":"tCO2e/mile"},{"$f":"IFERROR(VLOOKUP($N20,'Emission factors'!$C:$BQ,9,FALSE),\"\")","v":""},{"$f":"IFERROR(VLOOKUP($N20,'Emission factors'!$C:$BQ,12,FALSE),\"\")","v":""},{"$f":"IFERROR(VLOOKUP($N20,'Emission factors'!$C:$BQ,15,FALSE),\"\")","v":""},{"$f":"IFERROR(VLOOKUP($N20,'Emission factors'!$C:$BQ,65,FALSE),\"\")","v":4.2292126791028997E-4},{"$f":"IFERROR(VLOOKUP($N20,'Emission factors'!$C:$BQ,67,FALSE),\"\")","v":""},null,null,null,null,null,null,{"$f":"IFERROR(IF(AND($N20=\"\",$U20=\"\"),\"\",IF($N20=\"\",IF(V20=0,\"-\",V20),IF(P20=0,\"0\",$H20*IF($L20=\"\",1,$L20)*P20))),\"-\")","v":"-"},{"$f":"IFERROR(IF(AND($N20=\"\",$U20=\"\"),\"\",IF($N20=\"\",IF(W20=0,\"-\",W20),IF(Q20=0,\"0\",$H20*IF($L20=\"\",1,$L20)*Q20))),\"-\")","v":"-"},{"$f":"IFERROR(IF(AND($N20=\"\",$U20=\"\"),\"\",IF($N20=\"\",IF(X20=0,\"-\",X20),IF(R20=0,\"0\",$H20*IF($L20=\"\",1,$L20)*R20))),\"-\")","v":"-"},1697.3650129370035,"-"]
[null,"II.1.1",1,"Geographic / Territorial","Diesel oil","Passenger truck",null,{"$f":"'[3]VMT from Client'!$V6","v":27532976.751424313},"VMT",null,null,null,"CO2, CH4, N2O","EF_passenger truck - diesel",{"$f":"IFERROR(CONCATENATE(\"tCO2e/\",VLOOKUP($N21,'Emission factors'!$C:$I,6,FALSE)),\"\")","v":"tCO2e/mile"},{"$f":"IFERROR(VLOOKUP($N21,'Emission factors'!$C:$BQ,9,FALSE),\"\")","v":""},{"$f":"IFERROR(VLOOKUP($N21,'Emission factors'!$C:$BQ,12,FALSE),\"\")","v":""},{"$f":"IFERROR(VLOOKUP($N21,'Emission factors'!$C:$BQ,15,FALSE),\"\")","v":""},{"$f":"IFERROR(VLOOKUP($N21,'Emission factors'!$C:$BQ,65,FALSE),\"\")","v":7.2198718604702262E-4},{"$f":"IFERROR(VLOOKUP($N21,'Emission factors'!$C:$BQ,67,FALSE),\"\")","v":""},null,null,null,null,null,null,{"$f":"IFERROR(IF(AND($N21=\"\",$U21=\"\"),\"\",IF($N21=\"\",IF(V21=0,\"-\",V21),IF(P21=0,\"0\",$H21*IF($L21=\"\",1,$L21)*P21))),\"-\")","v":"-"},{"$f":"IFERROR(IF(AND($N21=\"\",$U21=\"\"),\"\",IF($N21=\"\",IF(W21=0,\"-\",W21),IF(Q21=0,\"0\",$H21*IF($L21=\"\",1,$L21)*Q21))),\"-\")","v":"-"},{"$f":"IFERROR(IF(AND($N21=\"\",$U21=\"\"),\"\",IF($N21=\"\",IF(X21=0,\"-\",X21),IF(R21=0,\"0\",$H21*IF($L21=\"\",1,$L21)*R21))),\"-\")","v":"-"},19878.456408258935,"-"]
[null,"II.1.1",1,"Geographic / Territorial","Diesel oil","Light commercial truck",null,{"$f":"'[3]VMT from Client'!$V7","v":48424249.960803658},"VMT",null,null,null,"CO2, CH4, N2O","EF_light commercial truck - diesel",{"$f":"IFERROR(CONCATENATE(\"tCO2e/\",VLOOKUP($N22,'Emission factors'!$C:$I,6,FALSE)),\"\")","v":"tCO2e/mile"},{"$f":"IFERROR(VLOOKUP($N22,'Emission factors'!$C:$BQ,9,FALSE),\"\")","v":""},{"$f":"IFERROR(VLOOKUP($N22,'Emission factors'!$C:$BQ,12,FALSE),\"\")","v":""},{"$f":"IFERROR(VLOOKUP($N22,'Emission factors'!$C:$BQ,15,FALSE),\"\")","v":""},{"$f":"IFERROR(VLOOKUP($N22,'Emission factors'!$C:$BQ,65,FALSE),\"\")","v":7.1536528115468713E-4},{"$f":"IFERROR(VLOOKUP($N22,'Emission factors'!$C:$BQ,67,FALSE),\"\")","v":""},null,null,null,null,null,null,{"$f":"IFERROR(IF(AND($N22=\"\",$U22=\"\"),\"\",IF($N22=\"\",IF(V22=0,\"-\",V22),IF(P22=0,\"0\",$H22*IF($L22=\"\",1,$L22)*P22))),\"-\")","v":"-"},{"$f":"IFERROR(IF(AND($N22=\"\",$U22=\"\"),\"\",IF($N22=\"\",IF(W22=0,\"-\",W22),IF(Q22=0,\"0\",$H22*IF($L22=\"\",1,$L22)*Q22))),\"-\")","v":"-"},{"$f":"IFERROR(IF(AND($N22=\"\",$U22=\"\"),\"\",IF($N22=\"\",IF(X22=0,\"-\",X22),IF(R22=0,\"0\",$H22*IF($L22=\"\",1,$L22)*R22))),\"-\")","v":"-"},34641.027187915155,"-"]
[null,"II.1.1",1,"Geographic / Territorial","Diesel oil","Intercity bus",null,{"$f":"'[3]VMT from Client'!$V8","v":13714188.100102939},"VMT",null,null,null,"CO2, CH4, N2O","EF_intercity bus - diesel",{"$f":"IFERROR(CONCATENATE(\"tCO2e/\",VLOOKUP($N23,'Emission factors'!$C:$I,6,FALSE)),\"\")","v":"tCO2e/mile"},{"$f":"IFERROR(VLOOKUP($N23,'Emission factors'!$C:$BQ,9,FALSE),\"\")","v":""},{"$f":"IFERROR(VLOOKUP($N23,'Emission factors'!$C:$BQ,12,FALSE),\"\")","v":""},{"$f":"IFERROR(VLOOKUP($N23,'Emission factors'!$C:$BQ,15,FALSE),\"\")","v":""},{"$f":"IFERROR(VLOOKUP($N23,'Emission factors'!$C:$BQ,65,FALSE),\"\")","v":1.8975550919793885E-3},{"$f":"IFERROR(VLOOKUP($N23,'Emission factors'!$C:$BQ,67,FALSE),\"\")","v":""},null,null,null,null,null,null,{"$f":"IFERROR(IF(AND($N23=\"\",$U23=\"\"),\"\",IF($N23=\"\",IF(V23=0,\"-\",V23),IF(P23=0,\"0\",$H23*IF($L23=\"\",1,$L23)*P23))),\"-\")","v":"-"},{"$f":"IFERROR(IF(AND($N23=\"\",$U23=\"\"),\"\",IF($N23=\"\",IF(W23=0,\"-\",W23),IF(Q23=0,\"0\",$H23*IF($L23=\"\",1,$L23)*Q23))),\"-\")","v":"-"},{"$f":"IFERROR(IF(AND($N23=\"\",$U23=\"\"),\"\",IF($N23=\"\",IF(X23=0,\"-\",X23),IF(R23=0,\"0\",$H23*IF($L23=\"\",1,$L23)*R23))),\"-\")","v":"-"},26023.427461713469,"-"]
[null,"II.1.1",1,"Geographic / Territorial","Diesel oil","Transit bus",null,{"$f":"'[3]VMT from Client'!$V9","v":41142564.300308816},"VMT",null,null,null,"CO2, CH4, N2O","EF_transit bus - diesel",{"$f":"IFERROR(CONCATENATE(\"tCO2e/\",VLOOKUP($N24,'Emission factors'!$C:$I,6,FALSE)),\"\")","v":"tCO2e/mile"},{"$f":"IFERROR(VLOOKUP($N24,'Emission factors'!$C:$BQ,9,FALSE),\"\")","v":""},{"$f":"IFERROR(VLOOKUP($N24,'Emission factors'!$C:$BQ,12,FALSE),\"\")","v":""},{"$f":"IFERROR(VLOOKUP($N24,'Emission factors'!$C:$BQ,15,FALSE),\"\")","v":""},{"$f":"IFERROR(VLOOKUP($N24,'Emission factors'!$C:$BQ,65,FALSE),\"\")","v":1.2662504342259324E-3},{"$f":"IFERROR(VLOOKUP($N24,'Emission factors'!$C:$BQ,67,FALSE),\"\")","v":""},null,null,null,null,null,null,{"$f":"IFERROR(IF(AND($N24=\"\",$U24=\"\"),\"\",IF($N24=\"\",IF(V24=0,\"-\",V24),IF(P24=0,\"0\",$H24*IF($L24=\"\",1,$L24)*P24))),\"-\")","v":"-"},{"$f":"IFERROR(IF(AND($N24=\"\",$U24=\"\"),\"\",IF($N24=\"\",IF(W24=0,\"-\",W24),IF(Q24=0,\"0\",$H24*IF($L24=\"\",1,$L24)*Q24))),\"-\")","v":"-"},{"$f":"IFERROR(IF(AND($N24=\"\",$U24=\"\"),\"\",IF($N24=\"\",IF(X24=0,\"-\",X24),IF(R24=0,\"0\",$H24*IF($L24=\"\",1,$L24)*R24))),\"-\")","v":"-"},52096.789910434381,"-"]
[null,"II.1.1",1,"Geographic / Territorial","Diesel oil","School bus",null,{"$f":"'[3]VMT from Client'!$V10","v":12125048.466884479},"VMT",null,null,null,"CO2, CH4, N2O","EF_school bus - diesel",{"$f":"IFERROR(CONCATENATE(\"tCO2e/\",VLOOKUP($N25,'Emission factors'!$C:$I,6,FALSE)),\"\")","v":"tCO2e/mile"},{"$f":"IFERROR(VLOOKUP($N25,'Emission factors'!$C:$BQ,9,FALSE),\"\")","v":""},{"$f":"IFERROR(VLOOKUP($N25,'Emission factors'!$C:$BQ,12,FALSE),\"\")","v":""},{"$f":"IFERROR(VLOOKUP($N25,'Emission factors'!$C:$BQ,15,FALSE),\"\")","v":""},{"$f":"IFERROR(VLOOKUP($N25,'Emission factors'!$C:$BQ,65,FALSE),\"\")","v":9.3832190100646279E-4},{"$f":"IFERROR(VLOOKUP($N25,'Emission factors'!$C:$BQ,67,FALSE),\"\")","v":""},null,null,null,null,null,null,{"$f":"IFERROR(IF(AND($N25=\"\",$U25=\"\"),\"\",IF($N25=\"\",IF(V25=0,\"-\",V25),IF(P25=0,\"0\",$H25*IF($L25=\"\",1,$L25)*P25))),\"-\")","v":"-"},{"$f":"IFERROR(IF(AND($N25=\"\",$U25=\"\"),\"\",IF($N25=\"\",IF(W25=0,\"-\",W25),IF(Q25=0,\"0\",$H25*IF($L25=\"\",1,$L25)*Q25))),\"-\")","v":"-"},{"$f":"IFERROR(IF(AND($N25=\"\",$U25=\"\"),\"\",IF($N25=\"\",IF(X25=0,\"-\",X25),IF(R25=0,\"0\",$H25*IF($L25=\"\",1,$L25)*R25))),\"-\")","v":"-"},11377.198527242541,"-"]
[null,"II.1.1",1,"Geographic / Territorial","Diesel oil","Refuse truck",null,{"$f":"'[3]VMT from Client'!$V11","v":14883714.94560115},"VMT",null,null,null,"CO2, CH4, N2O","EF_refuse truck - diesel",{"$f":"IFERROR(CONCATENATE(\"tCO2e/\",VLOOKUP($N26,'Emission factors'!$C:$I,6,FALSE)),\"\")","v":"tCO2e/mile"},{"$f":"IFERROR(VLOOKUP($N26,'Emission factors'!$C:$BQ,9,FALSE),\"\")","v":""},{"$f":"IFERROR(VLOOKUP($N26,'Emission factors'!$C:$BQ,12,FALSE),\"\")","v":""},{"$f":"IFERROR(VLOOKUP($N26,'Emission factors'!$C:$BQ,15,FALSE),\"\")","v":""},{"$f":"IFERROR(VLOOKUP($N26,'Emission factors'!$C:$BQ,65,FALSE),\"\")","v":1.7768988900772097E-3},{"$f":"IFERROR(VLOOKUP($N26,'Emission factors'!$C:$BQ,67,FALSE),\"\")","v":""},null,null,null,null,null,null,{"$f":"IFERROR(IF(AND($N26=\"\",$U26=\"\"),\"\",IF($N26=\"\",IF(V26=0,\"-\",V26),IF(P26=0,\"0\",$H26*IF($L26=\"\",1,$L26)*P26))),\"-\")","v":"-"},{"$f":"IFERROR(IF(AND($N26=\"\",$U26=\"\"),\"\",IF($N26=\"\",IF(W26=0,\"-\",W26),IF(Q26=0,\"0\",$H26*IF($L26=\"\",1,$L26)*Q26))),\"-\")","v":"-"},{"$f":"IFERROR(IF(AND($N26=\"\",$U26=\"\"),\"\",IF($N26=\"\",IF(X26=0,\"-\",X26),IF(R26=0,\"0\",$H26*IF($L26=\"\",1,$L26)*R26))),\"-\")","v":"-"},26446.85656706426,"-"]
[null,"II.1.1",1,"Geographic / Territorial","Diesel oil","Single unit short-haul truck",null,{"$f":"'[3]VMT from Client'!$V12","v":281672563.25616002},"VMT",null,null,null,"CO2, CH4, N2O","EF_single unit short haul truck - diesel",{"$f":"IFERROR(CONCATENATE(\"tCO2e/\",VLOOKUP($N27,'Emission factors'!$C:$I,6,FALSE)),\"\")","v":"tCO2e/mile"},{"$f":"IFERROR(VLOOKUP($N27,'Emission factors'!$C:$BQ,9,FALSE),\"\")","v":""},{"$f":"IFERROR(VLOOKUP($N27,'Emission factors'!$C:$BQ,12,FALSE),\"\")","v":""},{"$f":"IFERROR(VLOOKUP($N27,'Emission factors'!$C:$BQ,15,FALSE),\"\")","v":""},{"$f":"IFERROR(VLOOKUP($N27,'Emission factors'!$C:$BQ,65,FALSE),\"\")","v":1.1228798938417728E-3},{"$f":"IFERROR(VLOOKUP($N27,'Emission factors'!$C:$BQ,67,FALSE),\"\")","v":""},null,null,null,null,null,null,{"$f":"IFERROR(IF(AND($N27=\"\",$U27=\"\"),\"\",IF($N27=\"\",IF(V27=0,\"-\",V27),IF(P27=0,\"0\",$H27*IF($L27=\"\",1,$L27)*P27))),\"-\")","v":"-"},{"$f":"IFERROR(IF(AND($N27=\"\",$U27=\"\"),\"\",IF($N27=\"\",IF(W27=0,\"-\",W27),IF(Q27=0,\"0\",$H27*IF($L27=\"\",1,$L27)*Q27))),\"-\")","v":"-"},{"$f":"IFERROR(IF(AND($N27=\"\",$U27=\"\"),\"\",IF($N27=\"\",IF(X27=0,\"-\",X27),IF(R27=0,\"0\",$H27*IF($L27=\"\",1,$L27)*R27))),\"-\")","v":"-"},316284.45792721701,"-"]
[null,"II.1.1",1,"Geographic / Territorial","Diesel oil","Single unit long-haul truck",null,{"$f":"'[3]VMT from Client'!$V13","v":20007999.074736483},"VMT",null,null,null,"CO2, CH4, N2O","EF_single unit long-haul truck - diesel",{"$f":"IFERROR(CONCATENATE(\"tCO2e/\",VLOOKUP($N28,'Emission factors'!$C:$I,6,FALSE)),\"\")","v":"tCO2e/mile"},{"$f":"IFERROR(VLOOKUP($N28,'Emission factors'!$C:$BQ,9,FALSE),\"\")","v":""},{"$f":"IFERROR(VLOOKUP($N28,'Emission factors'!$C:$BQ,12,FALSE),\"\")","v":""},{"$f":"IFERROR(VLOOKUP($N28,'Emission factors'!$C:$BQ,15,FALSE),\"\")","v":""},{"$f":"IFERROR(VLOOKUP($N28,'Emission factors'!$C:$BQ,65,FALSE),\"\")","v":1.0677835858651005E-3},{"$f":"IFERROR(VLOOKUP($N28,'Emission factors'!$C:$BQ,67,FALSE),\"\")","v":""},null,null,null,null,null,null,{"$f":"IFERROR(IF(AND($N28=\"\",$U28=\"\"),\"\",IF($N28=\"\",IF(V28=0,\"-\",V28),IF(P28=0,\"0\",$H28*IF($L28=\"\",1,$L28)*P28))),\"-\")","v":"-"},{"$f":"IFERROR(IF(AND($N28=\"\",$U28=\"\"),\"\",IF($N28=\"\",IF(W28=0,\"-\",W28),IF(Q28=0,\"0\",$H28*IF($L28=\"\",1,$L28)*Q28))),\"-\")","v":"-"},{"$f":"IFERROR(IF(AND($N28=\"\",$U28=\"\"),\"\",IF($N28=\"\",IF(X28=0,\"-\",X28),IF(R28=0,\"0\",$H28*IF($L28=\"\",1,$L28)*R28))),\"-\")","v":"-"},21364.212998007733,"-"]
[null,"II.1.1",1,"Geographic / Territorial","Diesel oil","Motor home",null,{"$f":"'[3]VMT from Client'!$V14","v":7173997.7807894675},"VMT",null,null,null,"CO2, CH4, N2O","EF_motor home - diesel",{"$f":"IFERROR(CONCATENATE(\"tCO2e/\",VLOOKUP($N29,'Emission factors'!$C:$I,6,FALSE)),\"\")","v":"tCO2e/mile"},{"$f":"IFERROR(VLOOKUP($N29,'Emission factors'!$C:$BQ,9,FALSE),\"\")","v":""},{"$f":"IFERROR(VLOOKUP($N29,'Emission factors'!$C:$BQ,12,FALSE),\"\")","v":""},{"$f":"IFERROR(VLOOKUP($N29,'Emission factors'!$C:$BQ,15,FALSE),\"\")","v":""},{"$f":"IFERROR(VLOOKUP($N29,'Emission factors'!$C:$BQ,65,FALSE),\"\")","v":1.1425424580070445E-3},{"$f":"IFERROR(VLOOKUP($N29,'Emission factors'!$C:$BQ,67,FALSE),\"\")","v":""},null,null,null,null,null,null,{"$f":"IFERROR(IF(AND($N29=\"\",$U29=\"\"),\"\",IF($N29=\"\",IF(V29=0,\"-\",V29),IF(P29=0,\"0\",$H29*IF($L29=\"\",1,$L29)*P29))),\"-\")","v":"-"},{"$f":"IFERROR(IF(AND($N29=\"\",$U29=\"\"),\"\",IF($N29=\"\",IF(W29=0,\"-\",W29),IF(Q29=0,\"0\",$H29*IF($L29=\"\",1,$L29)*Q29))),\"-\")","v":"-"},{"$f":"IFERROR(IF(AND($N29=\"\",$U29=\"\"),\"\",IF($N29=\"\",IF(X29=0,\"-\",X29),IF(R29=0,\"0\",$H29*IF($L29=\"\",1,$L29)*R29))),\"-\")","v":"-"},8196.597058200281,"-"]
[null,"II.1.1",1,"Geographic / Territorial","Diesel oil","Combination short-haul truck",null,{"$f":"'[3]VMT from Client'!$V15","v":253803442.18014419},"VMT",null,null,null,"CO2, CH4, N2O","EF_combination short-haul truck - diesel",{"$f":"IFERROR(CONCATENATE(\"tCO2e/\",VLOOKUP($N30,'Emission factors'!$C:$I,6,FALSE)),\"\")","v":"tCO2e/mile"},{"$f":"IFERROR(VLOOKUP($N30,'Emission factors'!$C:$BQ,9,FALSE),\"\")","v":""},{"$f":"IFERROR(VLOOKUP($N30,'Emission factors'!$C:$BQ,12,FALSE),\"\")","v":""},{"$f":"IFERROR(VLOOKUP($N30,'Emission factors'!$C:$BQ,15,FALSE),\"\")","v":""},{"$f":"IFERROR(VLOOKUP($N30,'Emission factors'!$C:$BQ,65,FALSE),\"\")","v":2.1437020581771653E-3},{"$f":"IFERROR(VLOOKUP($N30,'Emission factors'!$C:$BQ,67,FALSE),\"\")","v":""},null,null,null,null,null,null,{"$f":"IFERROR(IF(AND($N30=\"\",$U30=\"\"),\"\",IF($N30=\"\",IF(V30=0,\"-\",V30),IF(P30=0,\"0\",$H30*IF($L30=\"\",1,$L30)*P30))),\"-\")","v":"-"},{"$f":"IFERROR(IF(AND($N30=\"\",$U30=\"\"),\"\",IF($N30=\"\",IF(W30=0,\"-\",W30),IF(Q30=0,\"0\",$H30*IF($L30=\"\",1,$L30)*Q30))),\"-\")","v":"-"},{"$f":"IFERROR(IF(AND($N30=\"\",$U30=\"\"),\"\",IF($N30=\"\",IF(X30=0,\"-\",X30),IF(R30=0,\"0\",$H30*IF($L30=\"\",1,$L30)*R30))),\"-\")","v":"-"},544078.96137402428,"-"]
[null,"II.1.1",1,"Geographic / Territorial","Diesel oil","Combination long-haul truck",null,{"$f":"'[3]VMT from Client'!$V16","v":217886871.33397952},"VMT",null,null,null,"CO2, CH4, N2O","EF_combination long-haul truck - diesel",{"$f":"IFERROR(CONCATENATE(\"tCO2e/\",VLOOKUP($N31,'Emission factors'!$C:$I,6,FALSE)),\"\")","v":"tCO2e/mile"},{"$f":"IFERROR(VLOOKUP($N31,'Emission factors'!$C:$BQ,9,FALSE),\"\")","v":""},{"$f":"IFERROR(VLOOKUP($N31,'Emission factors'!$C:$BQ,12,FALSE),\"\")","v":""},{"$f":"IFERROR(VLOOKUP($N31,'Emission factors'!$C:$BQ,15,FALSE),\"\")","v":""},{"$f":"IFERROR(VLOOKUP($N31,'Emission factors'!$C:$BQ,65,FALSE),\"\")","v":2.2312686090655582E-3},{"$f":"IFERROR(VLOOKUP($N31,'Emission factors'!$C:$BQ,67,FALSE),\"\")","v":""},null,null,null,null,null,null,{"$f":"IFERROR(IF(AND($N31=\"\",$U31=\"\"),\"\",IF($N31=\"\",IF(V31=0,\"-\",V31),IF(P31=0,\"0\",$H31*IF($L31=\"\",1,$L31)*P31))),\"-\")","v":"-"},{"$f":"IFERROR(IF(AND($N31=\"\",$U31=\"\"),\"\",IF($N31=\"\",IF(W31=0,\"-\",W31),IF(Q31=0,\"0\",$H31*IF($L31=\"\",1,$L31)*Q31))),\"-\")","v":"-"},{"$f":"IFERROR(IF(AND($N31=\"\",$U31=\"\"),\"\",IF($N31=\"\",IF(X31=0,\"-\",X31),IF(R31=0,\"0\",$H31*IF($L31=\"\",1,$L31)*R31))),\"-\")","v":"-"},{"$f":"IFERROR(IF(AND($N31=\"\",$U31=\"\"),\"\",IF($N31=\"\",IF(Y31=\"\",SUM(AA31:AC31),IF(Y31=0,\"0\",Y31)),IF($S31=\"\",SUM($AA31:$AC31),IF($S31=0,\"0\",$H31*IF($L31=\"\",1,$L31)*$S31)))),\"-\")","v":486164.13633501471},{"$f":"IFERROR(IF(AND($N31=\"\",$U31=\"\"),\"\",IF($N31=\"\",IF(Z31=0,\"\",Z31),IF(T31=0,\"0\",$H31*IF($L31=\"\",1,$L31)*T31))),\"-\")","v":"-"}]
[null,"II.1.1",1,"Geographic / Territorial","Other (please specify)","Reduction for alternative fuels - local",null,null,null,null,null,null,null,null,{"$f":"IFERROR(CONCATENATE(\"tCO2e/\",VLOOKUP($N32,'Emission factors'!$C:$I,6,FALSE)),\"\")","v":""},{"$f":"IFERROR(VLOOKUP($N32,'Emission factors'!$C:$BQ,9,FALSE),\"\")","v":""},{"$f":"IFERROR(VLOOKUP($N32,'Emission factors'!$C:$BQ,12,FALSE),\"\")","v":""},{"$f":"IFERROR(VLOOKUP($N32,'Emission factors'!$C:$BQ,15,FALSE),\"\")","v":""},{"$f":"IFERROR(VLOOKUP($N32,'Emission factors'!$C:$BQ,65,FALSE),\"\")","v":""},{"$f":"IFERROR(VLOOKUP($N32,'Emission factors'!$C:$BQ,67,FALSE),\"\")","v":""},"✓",null,null,null,{"$f":"'[3]Alt fuel calculations'!$L$146","v":-4084.2614254540017},null,{"$f":"IFERROR(IF(AND($N32=\"\",$U32=\"\"),\"\",IF($N32=\"\",IF(V32=0,\"-\",V32),IF(P32=0,\"0\",$H32*IF($L32=\"\",1,$L32)*P32))),\"-\")","v":"-"},{"$f":"IFERROR(IF(AND($N32=\"\",$U32=\"\"),\"\",IF($N32=\"\",IF(W32=0,\"-\",W32),IF(Q32=0,\"0\",$H32*IF($L32=\"\",1,$L32)*Q32))),\"-\")","v":"-"},{"$f":"IFERROR(IF(AND($N32=\"\",$U32=\"\"),\"\",IF($N32=\"\",IF(X32=0,\"-\",X32),IF(R32=0,\"0\",$H32*IF($L32=\"\",1,$L32)*R32))),\"-\")","v":"-"},{"$f":"IFERROR(IF(AND($N32=\"\",$U32=\"\"),\"\",IF($N32=\"\",IF(Y32=\"\",SUM(AA32:AC32),IF(Y32=0,\"0\",Y32)),IF($S32=\"\",SUM($AA32:$AC32),IF($S32=0,\"0\",$H32*IF($L32=\"\",1,$L32)*$S32)))),\"-\")","v":-4084.2614254540017},{"$f":"IFERROR(IF(AND($N32=\"\",$U32=\"\"),\"\",IF($N32=\"\",IF(Z32=0,\"\",Z32),IF(T32=0,\"0\",$H32*IF($L32=\"\",1,$L32)*T32))),\"-\")","v":""}]
[null,"II.1.1",1,"Geographic / Territorial","Other (please specify)","Reduction for alternative fuels - pass through",null,null,null,null,null,null,null,null,{"$f":"IFERROR(CONCATENATE(\"tCO2e/\",VLOOKUP($N33,'Emission factors'!$C:$I,6,FALSE)),\"\")","v":""},{"$f":"IFERROR(VLOOKUP($N33,'Emission factors'!$C:$BQ,9,FALSE),\"\")","v":""},{"$f":"IFERROR(VLOOKUP($N33,'Emission factors'!$C:$BQ,12,FALSE),\"\")","v":""},{"$f":"IFERROR(VLOOKUP($N33,'Emission factors'!$C:$BQ,15,FALSE),\"\")","v":""},{"$f":"IFERROR(VLOOKUP($N33,'Emission factors'!$C:$BQ,65,FALSE),\"\")","v":""},{"$f":"IFERROR(VLOOKUP($N33,'Emission factors'!$C:$BQ,67,FALSE),\"\")","v":""},"✓",null,null,null,{"$f":"'[3]Alt fuel calculations'!$L$130","v":-425.68118420471825},null,{"$f":"IFERROR(IF(AND($N33=\"\",$U33=\"\"),\"\",IF($N33=\"\",IF(V33=0,\"-\",V33),IF(P33=0,\"0\",$H33*IF($L33=\"\",1,$L33)*P33))),\"-\")","v":"-"},{"$f":"IFERROR(IF(AND($N33=\"\",$U33=\"\"),\"\",IF($N33=\"\",IF(W33=0,\"-\",W33),IF(Q33=0,\"0\",$H33*IF($L33=\"\",1,$L33)*Q33))),\"-\")","v":"-"},{"$f":"IFERROR(IF(AND($N33=\"\",$U33=\"\"),\"\",IF($N33=\"\",IF(X33=0,\"-\",X33),IF(R33=0,\"0\",$H33*IF($L33=\"\",1,$L33)*R33))),\"-\")","v":"-"},{"$f":"IFERROR(IF(AND($N33=\"\",$U33=\"\"),\"\",IF($N33=\"\",IF(Y33=\"\",SUM(AA33:AC33),IF(Y33=0,\"0\",Y33)),IF($S33=\"\",SUM($AA33:$AC33),IF($S33=0,\"0\",$H33*IF($L33=\"\",1,$L33)*$S33)))),\"-\")","v":-425.68118420471825},{"$f":"IFERROR(IF(AND($N33=\"\",$U33=\"\"),\"\",IF($N33=\"\",IF(Z33=0,\"\",Z33),IF(T33=0,\"0\",$H33*IF($L33=\"\",1,$L33)*T33))),\"-\")","v":""}]
[null,"II.1.2",2,"Emissions from grid-supplied energy consumed in the city for on-road transportation",null,null,"IE",null,null,null,null,null,null,null,null,null,null,null,null,null,null,null,null,null,null,null,null,null,null,null,null,null,null,"II.1.2 in included in stationary energy electricity use"]
[null,"II.1.2",2,null,null,null,null,null,null,null,null,null,null,null,{"$f":"IFERROR(CONCATENATE(\"tCO2e/\",VLOOKUP($N35,'Emission factors'!$C:$I,6,FALSE)),\"\")","v":""},{"$f":"IFERROR(VLOOKUP($N35,'Emission factors'!$C:$BQ,9,FALSE),\"\")","v":""},{"$f":"IFERROR(VLOOKUP($N35,'Emission factors'!$C:$BQ,12,FALSE),\"\")","v":""},{"$f":"IFERROR(VLOOKUP($N35,'Emission factors'!$C:$BQ,15,FALSE),\"\")","v":""},{"$f":"IFERROR(VLOOKUP($N35,'Emission factors'!$C:$BQ,65,FALSE),\"\")","v":""},{"$f":"IFERROR(VLOOKUP($N35,'Emission factors'!$C:$BQ,67,FALSE),\"\")","v":""},null,null,null,null,null,null,{"$f":"IFERROR(IF(AND($N35=\"\",$U35=\"\"),\"\",IF($N35=\"\",IF(V35=0,\"-\",V35),IF(P35=0,\"0\",$H35*IF($L35=\"\",1,$L35)*P35))),\"-\")","v":""},"","",{"$f":"IFERROR(IF(AND($N35=\"\",$U35=\"\"),\"\",IF($N35=\"\",IF(Y35=\"\",SUM(AA35:AC35),IF(Y35=0,\"0\",Y35)),IF($S35=\"\",SUM($AA35:$AC35),IF($S35=0,\"0\",$H35*IF($L35=\"\",1,$L35)*$S35)))),\"-\")","v":""},{"$f":"IFERROR(IF(AND($N35=\"\",$U35=\"\"),\"\",IF($N35=\"\",IF(Z35=0,\"\",Z35),IF(T35=0,\"0\",$H35*IF($L35=\"\",1,$L35)*T35))),\"-\")","v":""}]
[null,"II.1.2",2,null,null,null,null,null,null,null,null,null,null,null,{"$f":"IFERROR(CONCATENATE(\"tCO2e/\",VLOOKUP($N36,'Emission factors'!$C:$I,6,FALSE)),\"\")","v":""},{"$f":"IFERROR(VLOOKUP($N36,'Emission factors'!$C:$BQ,9,FALSE),\"\")","v":""},{"$f":"IFERROR(VLOOKUP($N36,'Emission factors'!$C:$BQ,12,FALSE),\"\")","v":""},{"$f":"IFERROR(VLOOKUP($N36,'Emission factors'!$C:$BQ,15,FALSE),\"\")","v":""},{"$f":"IFERROR(VLOOKUP($N36,'Emission factors'!$C:$BQ,65,FALSE),\"\")","v":""},{"$f":"IFERROR(VLOOKUP($N36,'Emission factors'!$C:$BQ,67,FALSE),\"\")","v":""},null,null,null,null,null,null,"","","",{"$f":"IFERROR(IF(AND($N36=\"\",$U36=\"\"),\"\",IF($N36=\"\",IF(Y36=\"\",SUM(AA36:AC36),IF(Y36=0,\"0\",Y36)),IF($S36=\"\",SUM($AA36:$AC36),IF($S36=0,\"0\",$H36*IF($L36=\"\",1,$L36)*$S36)))),\"-\")","v":""},{"$f":"IFERROR(IF(AND($N36=\"\",$U36=\"\"),\"\",IF($N36=\"\",IF(Z36=0,\"\",Z36),IF(T36=0,\"0\",$H36*IF($L36=\"\",1,$L36)*T36))),\"-\")","v":""}]
[null,"II.1.3",3,"Emissions from transboundary journeys occurring outside the city, and T&D losses from grid-supplied energy consumption",null,null,"NE",null,null,null,null,null,null,null,null,null,null,null,null,null,null,null,null,null,null,null,null,null,null,null,null,null,null,"II.1.3 has not been estimated - optional under GPC BASIC"]
[null,"II.1.3",3,null,null,null,null,null,null,null,null,null,null,null,{"$f":"IFERROR(CONCATENATE(\"tCO2e/\",VLOOKUP($N38,'Emission factors'!$C:$I,6,FALSE)),\"\")","v":""},{"$f":"IFERROR(VLOOKUP($N38,'Emission factors'!$C:$BQ,9,FALSE),\"\")","v":""},{"$f":"IFERROR(VLOOKUP($N38,'Emission factors'!$C:$BQ,12,FALSE),\"\")","v":""},{"$f":"IFERROR(VLOOKUP($N38,'Emission factors'!$C:$BQ,15,FALSE),\"\")","v":""},{"$f":"IFERROR(VLOOKUP($N38,'Emission factors'!$C:$BQ,65,FALSE),\"\")","v":""},{"$f":"IFERROR(VLOOKUP($N38,'Emission factors'!$C:$BQ,67,FALSE),\"\")","v":""},null,null,null,null,null,null,{"$f":"IFERROR(IF(AND($N38=\"\",$U38=\"\"),\"\",IF($N38=\"\",IF(V38=0,\"-\",V38),IF(P38=0,\"0\",$H38*IF($L38=\"\",1,$L38)*P38))),\"-\")","v":""},"","",{"$f":"IFERROR(IF(AND($N38=\"\",$U38=\"\"),\"\",IF($N38=\"\",IF(Y38=\"\",SUM(AA38:AC38),IF(Y38=0,\"0\",Y38)),IF($S38=\"\",SUM($AA38:$AC38),IF($S38=0,\"0\",$H38*IF($L38=\"\",1,$L38)*$S38)))),\"-\")","v":""},{"$f":"IFERROR(IF(AND($N38=\"\",$U38=\"\"),\"\",IF($N38=\"\",IF(Z38=0,\"\",Z38),IF(T38=0,\"0\",$H38*IF($L38=\"\",1,$L38)*T38))),\"-\")","v":""}]
[null,"II.1.3",3,null,null,null,null,null,null,null,null,null,null,null,{"$f":"IFERROR(CONCATENATE(\"tCO2e/\",VLOOKUP($N39,'Emission factors'!$C:$I,6,FALSE)),\"\")","v":""},{"$f":"IFERROR(VLOOKUP($N39,'Emission factors'!$C:$BQ,9,FALSE),\"\")","v":""},{"$f":"IFERROR(VLOOKUP($N39,'Emission factors'!$C:$BQ,12,FALSE),\"\")","v":""},{"$f":"IFERROR(VLOOKUP($N39,'Emission factors'!$C:$BQ,15,FALSE),\"\")","v":""},{"$f":"IFERROR(VLOOKUP($N39,'Emission factors'!$C:$BQ,65,FALSE),\"\")","v":""},{"$f":"IFERROR(VLOOKUP($N39,'Emission factors'!$C:$BQ,67,FALSE),\"\")","v":""},null,null,null,null,null,null,"","","",{"$f":"IFERROR(IF(AND($N39=\"\",$U39=\"\"),\"\",IF($N39=\"\",IF(Y39=\"\",SUM(AA39:AC39),IF(Y39=0,\"0\",Y39)),IF($S39=\"\",SUM($AA39:$AC39),IF($S39=0,\"0\",$H39*IF($L39=\"\",1,$L39)*$S39)))),\"-\")","v":""},{"$f":"IFERROR(IF(AND($N39=\"\",$U39=\"\"),\"\",IF($N39=\"\",IF(Z39=0,\"\",Z39),IF(T39=0,\"0\",$H39*IF($L39=\"\",1,$L39)*T39))),\"-\")","v":""}]
[]
[null,"II.2 RAILWAYS"]
[]
[null,"GPC ref No.","Scope","GHG Emissions Source",null,null,"Notation \nkeys","Activity data",null,"Activity data multiplier",null,null,"Gas(es)","Emission factor","Emission factor",null,null,null,null,null,"Emissions data","GHGs (metric tonnes CO2e)",null,null,null,null,"GHGs (metric tonnes CO2e)",null,null,null,null,"Data Quality",null,"Description of method(s) used or explanation for using notation key(s)","Source","Data quality explanation (optional)"]
[null,null,null,"Method","Activity","Description",null,"Amount","Units","From","To","Factor",null,null,"Units","CO2","CH4","N2O","Total tCO2e","CO2(b)",null,"CO2","CH4","N2O","Total tCO2e","CO2(b)","CO2","CH4","N2O","Total tCO2e","CO2(b)","AD","EF"]
[null,"II.2.1",1,"Emissions from fuel combustion for railway transportation occuring in the city"]
[null,"II.2.1",1,"Geographic / Territorial","Diesel oil","Metra rail",null,null,null,null,null,null,"CO2, CH4, N2O",null,{"$f":"IFERROR(CONCATENATE(\"tCO2e/\",VLOOKUP($N46,'Emission factors'!$C:$I,6,FALSE)),\"\")","v":""},{"$f":"IFERROR(VLOOKUP($N46,'Emission factors'!$C:$BQ,9,FALSE),\"\")","v":""},{"$f":"IFERROR(VLOOKUP($N46,'Emission factors'!$C:$BQ,12,FALSE),\"\")","v":""},{"$f":"IFERROR(VLOOKUP($N46,'Emission factors'!$C:$BQ,15,FALSE),\"\")","v":""},{"$f":"IFERROR(VLOOKUP($N46,'Emission factors'!$C:$BQ,65,FALSE),\"\")","v":""},{"$f":"IFERROR(VLOOKUP($N46,'Emission factors'!$C:$BQ,67,FALSE),\"\")","v":""},"✓",null,null,null,{"$f":"'[4]Transit emissions -v4 - 2 Nov'!$F$8","v":62587.199999999997},null,{"$f":"IFERROR(IF(AND($N46=\"\",$U46=\"\"),\"\",IF($N46=\"\",IF(V46=0,\"-\",V46),IF(P46=0,\"0\",$H46*IF($L46=\"\",1,$L46)*P46))),\"-\")","v":"-"},"-","-",{"$f":"IFERROR(IF(AND($N46=\"\",$U46=\"\"),\"\",IF($N46=\"\",IF(Y46=\"\",SUM(AA46:AC46),IF(Y46=0,\"0\",Y46)),IF($S46=\"\",SUM($AA46:$AC46),IF($S46=0,\"0\",$H46*IF($L46=\"\",1,$L46)*$S46)))),\"-\")","v":62587.199999999997},{"$f":"IFERROR(IF(AND($N46=\"\",$U46=\"\"),\"\",IF($N46=\"\",IF(Z46=0,\"\",Z46),IF(T46=0,\"0\",$H46*IF($L46=\"\",1,$L46)*T46))),\"-\")","v":""}]
[null,"II.2.1",1,null,null,null,null,null,null,null,null,null,null,null,{"$f":"IFERROR(CONCATENATE(\"tCO2e/\",VLOOKUP($N47,'Emission factors'!$C:$I,6,FALSE)),\"\")","v":""},{"$f":"IFERROR(VLOOKUP($N47,'Emission factors'!$C:$BQ,9,FALSE),\"\")","v":""},{"$f":"IFERROR(VLOOKUP($N47,'Emission factors'!$C:$BQ,12,FALSE),\"\")","v":""},{"$f":"IFERROR(VLOOKUP($N47,'Emission factors'!$C:$BQ,15,FALSE),\"\")","v":""},{"$f":"IFERROR(VLOOKUP($N47,'Emission factors'!$C:$BQ,65,FALSE),\"\")","v":""},{"$f":"IFERROR(VLOOKUP($N47,'Emission factors'!$C:$BQ,67,FALSE),\"\")","v":""},null,null,null,null,null,null,"","","",{"$f":"IFERROR(IF(AND($N47=\"\",$U47=\"\"),\"\",IF($N47=\"\",IF(Y47=\"\",SUM(AA47:AC47),IF(Y47=0,\"0\",Y47)),IF($S47=\"\",SUM($AA47:$AC47),IF($S47=0,\"0\",$H47*IF($L47=\"\",1,$L47)*$S47)))),\"-\")","v":""},{"$f":"IFERROR(IF(AND($N47=\"\",$U47=\"\"),\"\",IF($N47=\"\",IF(Z47=0,\"\",Z47),IF(T47=0,\"0\",$H47*IF($L47=\"\",1,$L47)*T47))),\"-\")","v":""}]
[null,"II.2.2",2,"Emissions from grid-supplied energy consumed in the city for railways"]
[null,"II.2.2",2,"Geographic / Territorial","Electricity","Chicago Transit Authority",null,{"$f":"'[4]Transit emissions-v5-03-01-12'!$F$9","v":407908038},"kWh","kWh","MWh",1E-3,"CO2, CH4, N2O","EF_electricity - transit",{"$f":"IFERROR(CONCATENATE(\"tCO2e/\",VLOOKUP($N49,'Emission factors'!$C:$I,6,FALSE)),\"\")","v":"tCO2e/MWH"},{"$f":"IFERROR(VLOOKUP($N49,'Emission factors'!$C:$BQ,9,FALSE),\"\")","v":""},{"$f":"IFERROR(VLOOKUP($N49,'Emission factors'!$C:$BQ,12,FALSE),\"\")","v":""},{"$f":"IFERROR(VLOOKUP($N49,'Emission factors'!$C:$BQ,15,FALSE),\"\")","v":""},{"$f":"IFERROR(VLOOKUP($N49,'Emission factors'!$C:$BQ,65,FALSE),\"\")","v":0.61669683023167798},{"$f":"IFERROR(VLOOKUP($N49,'Emission factors'!$C:$BQ,67,FALSE),\"\")","v":""},null,null,null,null,null,null,{"$f":"IFERROR(IF(AND($N49=\"\",$U49=\"\"),\"\",IF($N49=\"\",IF(V49=0,\"-\",V49),IF(P49=0,\"0\",$H49*IF($L49=\"\",1,$L49)*P49))),\"-\")","v":"-"},"-","-",{"$f":"IFERROR(IF(AND($N49=\"\",$U49=\"\"),\"\",IF($N49=\"\",IF(Y49=\"\",SUM(AA49:AC49),IF(Y49=0,\"0\",Y49)),IF($S49=\"\",SUM($AA49:$AC49),IF($S49=0,\"0\",$H49*IF($L49=\"\",1,$L49)*$S49)))),\"-\")","v":251555.59406062285},{"$f":"IFERROR(IF(AND($N49=\"\",$U49=\"\"),\"\",IF($N49=\"\",IF(Z49=0,\"\",Z49),IF(T49=0,\"0\",$H49*IF($L49=\"\",1,$L49)*T49))),\"-\")","v":"-"}]
[null,"II.2.2",2,null,null,null,null,null,null,null,null,null,null,null,{"$f":"IFERROR(CONCATENATE(\"tCO2e/\",VLOOKUP($N50,'Emission factors'!$C:$I,6,FALSE)),\"\")","v":""},{"$f":"IFERROR(VLOOKUP($N50,'Emission factors'!$C:$BQ,9,FALSE),\"\")","v":""},{"$f":"IFERROR(VLOOKUP($N50,'Emission factors'!$C:$BQ,12,FALSE),\"\")","v":""},{"$f":"IFERROR(VLOOKUP($N50,'Emission factors'!$C:$BQ,15,FALSE),\"\")","v":""},{"$f":"IFERROR(VLOOKUP($N50,'Emission factors'!$C:$BQ,65,FALSE),\"\")","v":""},{"$f":"IFERROR(VLOOKUP($N50,'Emission factors'!$C:$BQ,67,FALSE),\"\")","v":""},null,null,null,null,null,null,"","","",{"$f":"IFERROR(IF(AND($N50=\"\",$U50=\"\"),\"\",IF($N50=\"\",IF(Y50=\"\",SUM(AA50:AC50),IF(Y50=0,\"0\",Y50)),IF($S50=\"\",SUM($AA50:$AC50),IF($S50=0,\"0\",$H50*IF($L50=\"\",1,$L50)*$S50)))),\"-\")","v":""},{"$f":"IFERROR(IF(AND($N50=\"\",$U50=\"\"),\"\",IF($N50=\"\",IF(Z50=0,\"\",Z50),IF(T50=0,\"0\",$H50*IF($L50=\"\",1,$L50)*T50))),\"-\")","v":""}]
[null,"II.2.3",3,"Emissions from transboundary journeys occurring outside the city, and T&D losses from grid-supplied energy consumption",null,null,"NE",null,null,null,null,null,null,null,null,null,null,null,null,null,null,null,null,null,null,null,null,null,null,null,null,null,null,"II.2.3 has not been estimated - optional under GPC BASIC"]
[null,"II.2.3",3,null,null,null,null,null,null,null,null,null,null,null,{"$f":"IFERROR(CONCATENATE(\"tCO2e/\",VLOOKUP($N52,'Emission factors'!$C:$I,6,FALSE)),\"\")","v":""},{"$f":"IFERROR(VLOOKUP($N52,'Emission factors'!$C:$BQ,9,FALSE),\"\")","v":""},{"$f":"IFERROR(VLOOKUP($N52,'Emission factors'!$C:$BQ,12,FALSE),\"\")","v":""},{"$f":"IFERROR(VLOOKUP($N52,'Emission factors'!$C:$BQ,15,FALSE),\"\")","v":""},{"$f":"IFERROR(VLOOKUP($N52,'Emission factors'!$C:$BQ,65,FALSE),\"\")","v":""},{"$f":"IFERROR(VLOOKUP($N52,'Emission factors'!$C:$BQ,67,FALSE),\"\")","v":""},null,null,null,null,null,null,{"$f":"IFERROR(IF(AND($N52=\"\",$U52=\"\"),\"\",IF($N52=\"\",IF(V52=0,\"-\",V52),IF(P52=0,\"0\",$H52*IF($L52=\"\",1,$L52)*P52))),\"-\")","v":""},"","",{"$f":"IFERROR(IF(AND($N52=\"\",$U52=\"\"),\"\",IF($N52=\"\",IF(Y52=\"\",SUM(AA52:AC52),IF(Y52=0,\"0\",Y52)),IF($S52=\"\",SUM($AA52:$AC52),IF($S52=0,\"0\",$H52*IF($L52=\"\",1,$L52)*$S52)))),\"-\")","v":""},{"$f":"IFERROR(IF(AND($N52=\"\",$U52=\"\"),\"\",IF($N52=\"\",IF(Z52=0,\"\",Z52),IF(T52=0,\"0\",$H52*IF($L52=\"\",1,$L52)*T52))),\"-\")","v":""}]
[null,"II.2.3",3,null,null,null,null,null,null,null,null,null,null,null,{"$f":"IFERROR(CONCATENATE(\"tCO2e/\",VLOOKUP($N53,'Emission factors'!$C:$I,6,FALSE)),\"\")","v":""},{"$f":"IFERROR(VLOOKUP($N53,'Emission factors'!$C:$BQ,9,FALSE),\"\")","v":""},{"$f":"IFERROR(VLOOKUP($N53,'Emission factors'!$C:$BQ,12,FALSE),\"\")","v":""},{"$f":"IFERROR(VLOOKUP($N53,'Emission factors'!$C:$BQ,15,FALSE),\"\")","v":""},{"$f":"IFERROR(VLOOKUP($N53,'Emission factors'!$C:$BQ,65,FALSE),\"\")","v":""},{"$f":"IFERROR(VLOOKUP($N53,'Emission factors'!$C:$BQ,67,FALSE),\"\")","v":""},null,null,null,null,null,null,"","","",{"$f":"IFERROR(IF(AND($N53=\"\",$U53=\"\"),\"\",IF($N53=\"\",IF(Y53=\"\",SUM(AA53:AC53),IF(Y53=0,\"0\",Y53)),IF($S53=\"\",SUM($AA53:$AC53),IF($S53=0,\"0\",$H53*IF($L53=\"\",1,$L53)*$S53)))),\"-\")","v":""},{"$f":"IFERROR(IF(AND($N53=\"\",$U53=\"\"),\"\",IF($N53=\"\",IF(Z53=0,\"\",Z53),IF(T53=0,\"0\",$H53*IF($L53=\"\",1,$L53)*T53))),\"-\")","v":""}]
[]
[null,"II.3 WATERBORNE NAVIGATION"]
[]
[null,"GPC ref No.","Scope","GHG Emissions Source",null,null,"Notation \nkeys","Activity data",null,"Activity data multiplier",null,null,"Gas(es)","Emission factor","Emission factor",null,null,null,null,null,"Emissions data","GHGs (metric tonnes CO2e)",null,null,null,null,"GHGs (metric tonnes CO2e)",null,null,null,null,"Data Quality",null,"Description of method(s) used or explanation for using notation key(s)","Source","Data quality explanation (optional)"]
[null,null,null,"Method","Activity","Description",null,"Amount","Units","From","To","Factor",null,null,"Units","CO2","CH4","N2O","Total tCO2e","CO2(b)",null,"CO2","CH4","N2O","Total tCO2e","CO2(b)","CO2","CH4","N2O","Total tCO2e","CO2(b)","AD","EF"]
[null,"II.3.1",1,"Emissions from fuel combustion for waterborne navigation occurring in the city"]
[null,"II.3.1",1,"Geographic / Territorial","Diesel oil","Recreational marine vehicles (offroad)",null,null,null,null,null,null,"CO2, CH4, N2O",null,{"$f":"IFERROR(CONCATENATE(\"tCO2e/\",VLOOKUP($N60,'Emission factors'!$C:$I,6,FALSE)),\"\")","v":""},{"$f":"IFERROR(VLOOKUP($N60,'Emission factors'!$C:$BQ,9,FALSE),\"\")","v":""},{"$f":"IFERROR(VLOOKUP($N60,'Emission factors'!$C:$BQ,12,FALSE),\"\")","v":""},{"$f":"IFERROR(VLOOKUP($N60,'Emission factors'!$C:$BQ,15,FALSE),\"\")","v":""},{"$f":"IFERROR(VLOOKUP($N60,'Emission factors'!$C:$BQ,65,FALSE),\"\")","v":""},{"$f":"IFERROR(VLOOKUP($N60,'Emission factors'!$C:$BQ,67,FALSE),\"\")","v":""},"✓",null,null,null,{"$f":"'[4]NONROAD Summary totals'!$I$45","v":246.86441798931068},null,{"$f":"IFERROR(IF(AND($N60=\"\",$U60=\"\"),\"\",IF($N60=\"\",IF(V60=0,\"-\",V60),IF(P60=0,\"0\",$H60*IF($L60=\"\",1,$L60)*P60))),\"-\")","v":"-"},"-","-",{"$f":"IFERROR(IF(AND($N60=\"\",$U60=\"\"),\"\",IF($N60=\"\",IF(Y60=\"\",SUM(AA60:AC60),IF(Y60=0,\"0\",Y60)),IF($S60=\"\",SUM($AA60:$AC60),IF($S60=0,\"0\",$H60*IF($L60=\"\",1,$L60)*$S60)))),\"-\")","v":246.86441798931068},{"$f":"IFERROR(IF(AND($N60=\"\",$U60=\"\"),\"\",IF($N60=\"\",IF(Z60=0,\"\",Z60),IF(T60=0,\"0\",$H60*IF($L60=\"\",1,$L60)*T60))),\"-\")","v":""}]
[null,"II.3.1",1,null,null,null,null,null,null,null,null,null,null,null,{"$f":"IFERROR(CONCATENATE(\"tCO2e/\",VLOOKUP($N61,'Emission factors'!$C:$I,6,FALSE)),\"\")","v":""},{"$f":"IFERROR(VLOOKUP($N61,'Emission factors'!$C:$BQ,9,FALSE),\"\")","v":""},{"$f":"IFERROR(VLOOKUP($N61,'Emission factors'!$C:$BQ,12,FALSE),\"\")","v":""},{"$f":"IFERROR(VLOOKUP($N61,'Emission factors'!$C:$BQ,15,FALSE),\"\")","v":""},{"$f":"IFERROR(VLOOKUP($N61,'Emission factors'!$C:$BQ,65,FALSE),\"\")","v":""},{"$f":"IFERROR(VLOOKUP($N61,'Emission factors'!$C:$BQ,67,FALSE),\"\")","v":""},null,null,null,null,null,null,"","","",{"$f":"IFERROR(IF(AND($N61=\"\",$U61=\"\"),\"\",IF($N61=\"\",IF(Y61=\"\",SUM(AA61:AC61),IF(Y61=0,\"0\",Y61)),IF($S61=\"\",SUM($AA61:$AC61),IF($S61=0,\"0\",$H61*IF($L61=\"\",1,$L61)*$S61)))),\"-\")","v":""},{"$f":"IFERROR(IF(AND($N61=\"\",$U61=\"\"),\"\",IF($N61=\"\",IF(Z61=0,\"\",Z61),IF(T61=0,\"0\",$H61*IF($L61=\"\",1,$L61)*T61))),\"-\")","v":""}]
[null,"II.3.2",2,"Emissions from grid-supplied energy consumed in the city for waterborne navigation",null,null,"NO"]
[null,"II.3.2",2,null,null,null,null,null,null,null,null,null,null,null,{"$f":"IFERROR(CONCATENATE(\"tCO2e/\",VLOOKUP($N63,'Emission factors'!$C:$I,6,FALSE)),\"\")","v":""},{"$f":"IFERROR(VLOOKUP($N63,'Emission factors'!$C:$BQ,9,FALSE),\"\")","v":""},{"$f":"IFERROR(VLOOKUP($N63,'Emission factors'!$C:$BQ,12,FALSE),\"\")","v":""},{"$f":"IFERROR(VLOOKUP($N63,'Emission factors'!$C:$BQ,15,FALSE),\"\")","v":""},{"$f":"IFERROR(VLOOKUP($N63,'Emission factors'!$C:$BQ,65,FALSE),\"\")","v":""},{"$f":"IFERROR(VLOOKUP($N63,'Emission factors'!$C:$BQ,67,FALSE),\"\")","v":""},null,null,null,null,null,null,{"$f":"IFERROR(IF(AND($N63=\"\",$U63=\"\"),\"\",IF($N63=\"\",IF(V63=0,\"-\",V63),IF(P63=0,\"0\",$H63*IF($L63=\"\",1,$L63)*P63))),\"-\")","v":""},"","",{"$f":"IFERROR(IF(AND($N63=\"\",$U63=\"\"),\"\",IF($N63=\"\",IF(Y63=\"\",SUM(AA63:AC63),IF(Y63=0,\"0\",Y63)),IF($S63=\"\",SUM($AA63:$AC63),IF($S63=0,\"0\",$H63*IF($L63=\"\",1,$L63)*$S63)))),\"-\")","v":""},{"$f":"IFERROR(IF(AND($N63=\"\",$U63=\"\"),\"\",IF($N63=\"\",IF(Z63=0,\"\",Z63),IF(T63=0,\"0\",$H63*IF($L63=\"\",1,$L63)*T63))),\"-\")","v":""}]
[null,"II.3.2",2,null,null,null,null,null,null,null,null,null,null,null,{"$f":"IFERROR(CONCATENATE(\"tCO2e/\",VLOOKUP($N64,'Emission factors'!$C:$I,6,FALSE)),\"\")","v":""},{"$f":"IFERROR(VLOOKUP($N64,'Emission factors'!$C:$BQ,9,FALSE),\"\")","v":""},{"$f":"IFERROR(VLOOKUP($N64,'Emission factors'!$C:$BQ,12,FALSE),\"\")","v":""},{"$f":"IFERROR(VLOOKUP($N64,'Emission factors'!$C:$BQ,15,FALSE),\"\")","v":""},{"$f":"IFERROR(VLOOKUP($N64,'Emission factors'!$C:$BQ,65,FALSE),\"\")","v":""},{"$f":"IFERROR(VLOOKUP($N64,'Emission factors'!$C:$BQ,67,FALSE),\"\")","v":""},null,null,null,null,null,null,"","","",{"$f":"IFERROR(IF(AND($N64=\"\",$U64=\"\"),\"\",IF($N64=\"\",IF(Y64=\"\",SUM(AA64:AC64),IF(Y64=0,\"0\",Y64)),IF($S64=\"\",SUM($AA64:$AC64),IF($S64=0,\"0\",$H64*IF($L64=\"\",1,$L64)*$S64)))),\"-\")","v":""},{"$f":"IFERROR(IF(AND($N64=\"\",$U64=\"\"),\"\",IF($N64=\"\",IF(Z64=0,\"\",Z64),IF(T64=0,\"0\",$H64*IF($L64=\"\",1,$L64)*T64))),\"-\")","v":""}]
[null,"II.3.3",3,"Emissions from transboundary journeys occurring outside the city, and T&D losses from grid-supplied energy consumption",null,null,"NO"]
[null,"II.3.3",3,null,null,null,null,null,null,null,null,null,null,null,{"$f":"IFERROR(CONCATENATE(\"tCO2e/\",VLOOKUP($N66,'Emission factors'!$C:$I,6,FALSE)),\"\")","v":""},{"$f":"IFERROR(VLOOKUP($N66,'Emission factors'!$C:$BQ,9,FALSE),\"\")","v":""},{"$f":"IFERROR(VLOOKUP($N66,'Emission factors'!$C:$BQ,12,FALSE),\"\")","v":""},{"$f":"IFERROR(VLOOKUP($N66,'Emission factors'!$C:$BQ,15,FALSE),\"\")","v":""},{"$f":"IFERROR(VLOOKUP($N66,'Emission factors'!$C:$BQ,65,FALSE),\"\")","v":""},{"$f":"IFERROR(VLOOKUP($N66,'Emission factors'!$C:$BQ,67,FALSE),\"\")","v":""},null,null,null,null,null,null,{"$f":"IFERROR(IF(AND($N66=\"\",$U66=\"\"),\"\",IF($N66=\"\",IF(V66=0,\"-\",V66),IF(P66=0,\"0\",$H66*IF($L66=\"\",1,$L66)*P66))),\"-\")","v":""},"","",{"$f":"IFERROR(IF(AND($N66=\"\",$U66=\"\"),\"\",IF($N66=\"\",IF(Y66=\"\",SUM(AA66:AC66),IF(Y66=0,\"0\",Y66)),IF($S66=\"\",SUM($AA66:$AC66),IF($S66=0,\"0\",$H66*IF($L66=\"\",1,$L66)*$S66)))),\"-\")","v":""},{"$f":"IFERROR(IF(AND($N66=\"\",$U66=\"\"),\"\",IF($N66=\"\",IF(Z66=0,\"\",Z66),IF(T66=0,\"0\",$H66*IF($L66=\"\",1,$L66)*T66))),\"-\")","v":""}]
[null,"II.3.3",3,null,null,null,null,null,null,null,null,null,null,null,{"$f":"IFERROR(CONCATENATE(\"tCO2e/\",VLOOKUP($N67,'Emission factors'!$C:$I,6,FALSE)),\"\")","v":""},{"$f":"IFERROR(VLOOKUP($N67,'Emission factors'!$C:$BQ,9,FALSE),\"\")","v":""},{"$f":"IFERROR(VLOOKUP($N67,'Emission factors'!$C:$BQ,12,FALSE),\"\")","v":""},{"$f":"IFERROR(VLOOKUP($N67,'Emission factors'!$C:$BQ,15,FALSE),\"\")","v":""},{"$f":"IFERROR(VLOOKUP($N67,'Emission factors'!$C:$BQ,65,FALSE),\"\")","v":""},{"$f":"IFERROR(VLOOKUP($N67,'Emission factors'!$C:$BQ,67,FALSE),\"\")","v":""},null,null,null,null,null,null,"","","",{"$f":"IFERROR(IF(AND($N67=\"\",$U67=\"\"),\"\",IF($N67=\"\",IF(Y67=\"\",SUM(AA67:AC67),IF(Y67=0,\"0\",Y67)),IF($S67=\"\",SUM($AA67:$AC67),IF($S67=0,\"0\",$H67*IF($L67=\"\",1,$L67)*$S67)))),\"-\")","v":""},{"$f":"IFERROR(IF(AND($N67=\"\",$U67=\"\"),\"\",IF($N67=\"\",IF(Z67=0,\"\",Z67),IF(T67=0,\"0\",$H67*IF($L67=\"\",1,$L67)*T67))),\"-\")","v":""}]
[]
[null,"II.4 AVIATION"]
[]
[null,"GPC ref No.","Scope","GHG Emissions Source",null,null,"Notation \nkeys","Activity data",null,"Activity data multiplier",null,null,"Gas(es)","Emission factor","Emission factor",null,null,null,null,null,"Emissions data","GHGs (metric tonnes CO2e)",null,null,null,null,"GHGs (metric tonnes CO2e)",null,null,null,null,"Data Quality",null,"Description of method(s) used or explanation for using notation key(s)","Source","Data quality explanation (optional)"]
[null,null,null,"Method","Activity","Description",null,"Amount","Units","From","To","Factor",null,null,"Units","CO2","CH4","N2O","Total tCO2e","CO2(b)",null,"CO2","CH4","N2O","Total tCO2e","CO2(b)","CO2","CH4","N2O","Total tCO2e","CO2(b)","AD","EF"]
[null,"II.4.1",1,"Emissions from fuel combustion for aviation occurring in the city",null,null,"NO"]
[null,"II.4.1",1,null,null,null,null,null,null,null,null,null,null,null,{"$f":"IFERROR(CONCATENATE(\"tCO2e/\",VLOOKUP($N74,'Emission factors'!$C:$I,6,FALSE)),\"\")","v":""},{"$f":"IFERROR(VLOOKUP($N74,'Emission factors'!$C:$BQ,9,FALSE),\"\")","v":""},{"$f":"IFERROR(VLOOKUP($N74,'Emission factors'!$C:$BQ,12,FALSE),\"\")","v":""},{"$f":"IFERROR(VLOOKUP($N74,'Emission factors'!$C:$BQ,15,FALSE),\"\")","v":""},{"$f":"IFERROR(VLOOKUP($N74,'Emission factors'!$C:$BQ,65,FALSE),\"\")","v":""},{"$f":"IFERROR(VLOOKUP($N74,'Emission factors'!$C:$BQ,67,FALSE),\"\")","v":""},null,null,null,null,null,null,{"$f":"IFERROR(IF(AND($N74=\"\",$U74=\"\"),\"\",IF($N74=\"\",IF(V74=0,\"-\",V74),IF(P74=0,\"0\",$H74*IF($L74=\"\",1,$L74)*P74))),\"-\")","v":""},"","",{"$f":"IFERROR(IF(AND($N74=\"\",$U74=\"\"),\"\",IF($N74=\"\",IF(Y74=\"\",SUM(AA74:AC74),IF(Y74=0,\"0\",Y74)),IF($S74=\"\",SUM($AA74:$AC74),IF($S74=0,\"0\",$H74*IF($L74=\"\",1,$L74)*$S74)))),\"-\")","v":""},{"$f":"IFERROR(IF(AND($N74=\"\",$U74=\"\"),\"\",IF($N74=\"\",IF(Z74=0,\"\",Z74),IF(T74=0,\"0\",$H74*IF($L74=\"\",1,$L74)*T74))),\"-\")","v":""}]
[null,"II.4.1",1,null,null,null,null,null,null,null,null,null,null,null,{"$f":"IFERROR(CONCATENATE(\"tCO2e/\",VLOOKUP($N75,'Emission factors'!$C:$I,6,FALSE)),\"\")","v":""},{"$f":"IFERROR(VLOOKUP($N75,'Emission factors'!$C:$BQ,9,FALSE),\"\")","v":""},{"$f":"IFERROR(VLOOKUP($N75,'Emission factors'!$C:$BQ,12,FALSE),\"\")","v":""},{"$f":"IFERROR(VLOOKUP($N75,'Emission factors'!$C:$BQ,15,FALSE),\"\")","v":""},{"$f":"IFERROR(VLOOKUP($N75,'Emission factors'!$C:$BQ,65,FALSE),\"\")","v":""},{"$f":"IFERROR(VLOOKUP($N75,'Emission factors'!$C:$BQ,67,FALSE),\"\")","v":""},null,null,null,null,null,null,"","","",{"$f":"IFERROR(IF(AND($N75=\"\",$U75=\"\"),\"\",IF($N75=\"\",IF(Y75=\"\",SUM(AA75:AC75),IF(Y75=0,\"0\",Y75)),IF($S75=\"\",SUM($AA75:$AC75),IF($S75=0,\"0\",$H75*IF($L75=\"\",1,$L75)*$S75)))),\"-\")","v":""},{"$f":"IFERROR(IF(AND($N75=\"\",$U75=\"\"),\"\",IF($N75=\"\",IF(Z75=0,\"\",Z75),IF(T75=0,\"0\",$H75*IF($L75=\"\",1,$L75)*T75))),\"-\")","v":""}]
[null,"II.4.2",2,"Emissions from grid-supplied energy consumed in the city for aviation",null,null,"NO",null,null,null,null,null,null,null,null,null,null,null,null,null,null,null,null,null,null,null,null,null,null,null,null,null,null,"II.4.2 does not occur"]
[null,"II.4.2",2,null,null,null,null,null,null,null,null,null,null,null,{"$f":"IFERROR(CONCATENATE(\"tCO2e/\",VLOOKUP($N77,'Emission factors'!$C:$I,6,FALSE)),\"\")","v":""},{"$f":"IFERROR(VLOOKUP($N77,'Emission factors'!$C:$BQ,9,FALSE),\"\")","v":""},{"$f":"IFERROR(VLOOKUP($N77,'Emission factors'!$C:$BQ,12,FALSE),\"\")","v":""},{"$f":"IFERROR(VLOOKUP($N77,'Emission factors'!$C:$BQ,15,FALSE),\"\")","v":""},{"$f":"IFERROR(VLOOKUP($N77,'Emission factors'!$C:$BQ,65,FALSE),\"\")","v":""},{"$f":"IFERROR(VLOOKUP($N77,'Emission factors'!$C:$BQ,67,FALSE),\"\")","v":""},null,null,null,null,null,null,{"$f":"IFERROR(IF(AND($N77=\"\",$U77=\"\"),\"\",IF($N77=\"\",IF(V77=0,\"-\",V77),IF(P77=0,\"0\",$H77*IF($L77=\"\",1,$L77)*P77))),\"-\")","v":""},"","",{"$f":"IFERROR(IF(AND($N77=\"\",$U77=\"\"),\"\",IF($N77=\"\",IF(Y77=\"\",SUM(AA77:AC77),IF(Y77=0,\"0\",Y77)),IF($S77=\"\",SUM($AA77:$AC77),IF($S77=0,\"0\",$H77*IF($L77=\"\",1,$L77)*$S77)))),\"-\")","v":""},{"$f":"IFERROR(IF(AND($N77=\"\",$U77=\"\"),\"\",IF($N77=\"\",IF(Z77=0,\"\",Z77),IF(T77=0,\"0\",$H77*IF($L77=\"\",1,$L77)*T77))),\"-\")","v":""}]
[null,"II.4.2",2,null,null,null,null,null,null,null,null,null,null,null,{"$f":"IFERROR(CONCATENATE(\"tCO2e/\",VLOOKUP($N78,'Emission factors'!$C:$I,6,FALSE)),\"\")","v":""},{"$f":"IFERROR(VLOOKUP($N78,'Emission factors'!$C:$BQ,9,FALSE),\"\")","v":""},{"$f":"IFERROR(VLOOKUP($N78,'Emission factors'!$C:$BQ,12,FALSE),\"\")","v":""},{"$f":"IFERROR(VLOOKUP($N78,'Emission factors'!$C:$BQ,15,FALSE),\"\")","v":""},{"$f":"IFERROR(VLOOKUP($N78,'Emission factors'!$C:$BQ,65,FALSE),\"\")","v":""},{"$f":"IFERROR(VLOOKUP($N78,'Emission factors'!$C:$BQ,67,FALSE),\"\")","v":""},null,null,null,null,null,null,"","","",{"$f":"IFERROR(IF(AND($N78=\"\",$U78=\"\"),\"\",IF($N78=\"\",IF(Y78=\"\",SUM(AA78:AC78),IF(Y78=0,\"0\",Y78)),IF($S78=\"\",SUM($AA78:$AC78),IF($S78=0,\"0\",$H78*IF($L78=\"\",1,$L78)*$S78)))),\"-\")","v":""},{"$f":"IFERROR(IF(AND($N78=\"\",$U78=\"\"),\"\",IF($N78=\"\",IF(Z78=0,\"\",Z78),IF(T78=0,\"0\",$H78*IF($L78=\"\",1,$L78)*T78))),\"-\")","v":""}]
[null,"II.4.3",3,"Emissions from transboundary journeys occurring outside the city, and T&D losses from grid-supplied energy consumption",null,null,"NO"]
[null,"II.4.3",3,null,null,null,null,null,null,null,null,null,null,null,{"$f":"IFERROR(CONCATENATE(\"tCO2e/\",VLOOKUP($N80,'Emission factors'!$C:$I,6,FALSE)),\"\")","v":""},{"$f":"IFERROR(VLOOKUP($N80,'Emission factors'!$C:$BQ,9,FALSE),\"\")","v":""},{"$f":"IFERROR(VLOOKUP($N80,'Emission factors'!$C:$BQ,12,FALSE),\"\")","v":""},{"$f":"IFERROR(VLOOKUP($N80,'Emission factors'!$C:$BQ,15,FALSE),\"\")","v":""},{"$f":"IFERROR(VLOOKUP($N80,'Emission factors'!$C:$BQ,65,FALSE),\"\")","v":""},{"$f":"IFERROR(VLOOKUP($N80,'Emission factors'!$C:$BQ,67,FALSE),\"\")","v":""},null,null,null,null,null,null,{"$f":"IFERROR(IF(AND($N80=\"\",$U80=\"\"),\"\",IF($N80=\"\",IF(V80=0,\"-\",V80),IF(P80=0,\"0\",$H80*IF($L80=\"\",1,$L80)*P80))),\"-\")","v":""},"","",{"$f":"IFERROR(IF(AND($N80=\"\",$U80=\"\"),\"\",IF($N80=\"\",IF(Y80=\"\",SUM(AA80:AC80),IF(Y80=0,\"0\",Y80)),IF($S80=\"\",SUM($AA80:$AC80),IF($S80=0,\"0\",$H80*IF($L80=\"\",1,$L80)*$S80)))),\"-\")","v":""},{"$f":"IFERROR(IF(AND($N80=\"\",$U80=\"\"),\"\",IF($N80=\"\",IF(Z80=0,\"\",Z80),IF(T80=0,\"0\",$H80*IF($L80=\"\",1,$L80)*T80))),\"-\")","v":""}]
[null,"II.4.3",3,null,null,null,null,null,null,null,null,null,null,null,{"$f":"IFERROR(CONCATENATE(\"tCO2e/\",VLOOKUP($N81,'Emission factors'!$C:$I,6,FALSE)),\"\")","v":""},{"$f":"IFERROR(VLOOKUP($N81,'Emission factors'!$C:$BQ,9,FALSE),\"\")","v":""},{"$f":"IFERROR(VLOOKUP($N81,'Emission factors'!$C:$BQ,12,FALSE),\"\")","v":""},{"$f":"IFERROR(VLOOKUP($N81,'Emission factors'!$C:$BQ,15,FALSE),\"\")","v":""},{"$f":"IFERROR(VLOOKUP($N81,'Emission factors'!$C:$BQ,65,FALSE),\"\")","v":""},{"$f":"IFERROR(VLOOKUP($N81,'Emission factors'!$C:$BQ,67,FALSE),\"\")","v":""},null,null,null,null,null,null,"","","",{"$f":"IFERROR(IF(AND($N81=\"\",$U81=\"\"),\"\",IF($N81=\"\",IF(Y81=\"\",SUM(AA81:AC81),IF(Y81=0,\"0\",Y81)),IF($S81=\"\",SUM($AA81:$AC81),IF($S81=0,\"0\",$H81*IF($L81=\"\",1,$L81)*$S81)))),\"-\")","v":""},{"$f":"IFERROR(IF(AND($N81=\"\",$U81=\"\"),\"\",IF($N81=\"\",IF(Z81=0,\"\",Z81),IF(T81=0,\"0\",$H81*IF($L81=\"\",1,$L81)*T81))),\"-\")","v":""}]
[]
[null,"II.5 OFF-ROAD TRANSPORTATION"]
[]
[null,"GPC ref No.","Scope","GHG Emissions Source",null,null,"Notation \nkeys","Activity data",null,"Activity data multiplier",null,null,"Gas(es)","Emission factor","Emission factor",null,null,null,null,null,"Emissions data","GHGs (metric tonnes CO2e)",null,null,null,null,"GHGs (metric tonnes CO2e)",null,null,null,null,"Data Quality",null,"Description of method(s) used or explanation for using notation key(s)","Source","Data quality explanation (optional)"]
[null,null,null,"Method","Activity","Description",null,"Amount","Units","From","To","Factor",null,null,"Units","CO2","CH4","N2O","Total tCO2e","CO2(b)",null,"CO2","CH4","N2O","Total tCO2e","CO2(b)","CO2","CH4","N2O","Total tCO2e","CO2(b)","AD","EF"]
[null,"II.5.1",1,"Emissions from fuel combustion for off-road transportation occurring in the city"]
[null,"II.5.1",1,"Geographic / Territorial","Diesel oil","Railway maintenance vehicles",null,null,null,null,null,null,"CO2, CH4, N2O",null,{"$f":"IFERROR(CONCATENATE(\"tCO2e/\",VLOOKUP($N88,'Emission factors'!$C:$I,6,FALSE)),\"\")","v":""},{"$f":"IFERROR(VLOOKUP($N88,'Emission factors'!$C:$BQ,9,FALSE),\"\")","v":""},{"$f":"IFERROR(VLOOKUP($N88,'Emission factors'!$C:$BQ,12,FALSE),\"\")","v":""},{"$f":"IFERROR(VLOOKUP($N88,'Emission factors'!$C:$BQ,15,FALSE),\"\")","v":""},{"$f":"IFERROR(VLOOKUP($N88,'Emission factors'!$C:$BQ,65,FALSE),\"\")","v":""},{"$f":"IFERROR(VLOOKUP($N88,'Emission factors'!$C:$BQ,67,FALSE),\"\")","v":""},"✓",null,null,null,{"$f":"'[4]NONROAD Summary totals'!$I$37","v":1011.6726599300484},null,{"$f":"IFERROR(IF(AND($N88=\"\",$U88=\"\"),\"\",IF($N88=\"\",IF(V88=0,\"-\",V88),IF(P88=0,\"0\",$H88*IF($L88=\"\",1,$L88)*P88))),\"-\")","v":"-"},"-","-",{"$f":"IFERROR(IF(AND($N88=\"\",$U88=\"\"),\"\",IF($N88=\"\",IF(Y88=\"\",SUM(AA88:AC88),IF(Y88=0,\"0\",Y88)),IF($S88=\"\",SUM($AA88:$AC88),IF($S88=0,\"0\",$H88*IF($L88=\"\",1,$L88)*$S88)))),\"-\")","v":1011.6726599300484},{"$f":"IFERROR(IF(AND($N88=\"\",$U88=\"\"),\"\",IF($N88=\"\",IF(Z88=0,\"\",Z88),IF(T88=0,\"0\",$H88*IF($L88=\"\",1,$L88)*T88))),\"-\")","v":""}]
[null,"II.5.1",1,null,null,null,null,null,null,null,null,null,null,null,{"$f":"IFERROR(CONCATENATE(\"tCO2e/\",VLOOKUP($N89,'Emission factors'!$C:$I,6,FALSE)),\"\")","v":""},{"$f":"IFERROR(VLOOKUP($N89,'Emission factors'!$C:$BQ,9,FALSE),\"\")","v":""},{"$f":"IFERROR(VLOOKUP($N89,'Emission factors'!$C:$BQ,12,FALSE),\"\")","v":""},{"$f":"IFERROR(VLOOKUP($N89,'Emission factors'!$C:$BQ,15,FALSE),\"\")","v":""},{"$f":"IFERROR(VLOOKUP($N89,'Emission factors'!$C:$BQ,65,FALSE),\"\")","v":""},{"$f":"IFERROR(VLOOKUP($N89,'Emission factors'!$C:$BQ,67,FALSE),\"\")","v":""},null,null,null,null,null,null,"","","",{"$f":"IFERROR(IF(AND($N89=\"\",$U89=\"\"),\"\",IF($N89=\"\",IF(Y89=\"\",SUM(AA89:AC89),IF(Y89=0,\"0\",Y89)),IF($S89=\"\",SUM($AA89:$AC89),IF($S89=0,\"0\",$H89*IF($L89=\"\",1,$L89)*$S89)))),\"-\")","v":""},{"$f":"IFERROR(IF(AND($N89=\"\",$U89=\"\"),\"\",IF($N89=\"\",IF(Z89=0,\"\",Z89),IF(T89=0,\"0\",$H89*IF($L89=\"\",1,$L89)*T89))),\"-\")","v":""}]
[null,"II.5.2",2,"Emissions from grid-supplied energy consumed in the city for off-road transportation",null,null,"NO"]
[null,"II.5.2",2,null,null,null,null,null,null,null,null,null,null,null,{"$f":"IFERROR(CONCATENATE(\"tCO2e/\",VLOOKUP($N91,'Emission factors'!$C:$I,6,FALSE)),\"\")","v":""},{"$f":"IFERROR(VLOOKUP($N91,'Emission factors'!$C:$BQ,9,FALSE),\"\")","v":""},{"$f":"IFERROR(VLOOKUP($N91,'Emission factors'!$C:$BQ,12,FALSE),\"\")","v":""},{"$f":"IFERROR(VLOOKUP($N91,'Emission factors'!$C:$BQ,15,FALSE),\"\")","v":""},{"$f":"IFERROR(VLOOKUP($N91,'Emission factors'!$C:$BQ,65,FALSE),\"\")","v":""},{"$f":"IFERROR(VLOOKUP($N91,'Emission factors'!$C:$BQ,67,FALSE),\"\")","v":""},null,null,null,null,null,null,{"$f":"IFERROR(IF(AND($N91=\"\",$U91=\"\"),\"\",IF($N91=\"\",IF(V91=0,\"-\",V91),IF(P91=0,\"0\",$H91*IF($L91=\"\",1,$L91)*P91))),\"-\")","v":""},"","",{"$f":"IFERROR(IF(AND($N91=\"\",$U91=\"\"),\"\",IF($N91=\"\",IF(Y91=\"\",SUM(AA91:AC91),IF(Y91=0,\"0\",Y91)),IF($S91=\"\",SUM($AA91:$AC91),IF($S91=0,\"0\",$H91*IF($L91=\"\",1,$L91)*$S91)))),\"-\")","v":""},{"$f":"IFERROR(IF(AND($N91=\"\",$U91=\"\"),\"\",IF($N91=\"\",IF(Z91=0,\"\",Z91),IF(T91=0,\"0\",$H91*IF($L91=\"\",1,$L91)*T91))),\"-\")","v":""}]
[null,"II.5.2",2,null,null,null,null,null,null,null,null,null,null,null,{"$f":"IFERROR(CONCATENATE(\"tCO2e/\",VLOOKUP($N92,'Emission factors'!$C:$I,6,FALSE)),\"\")","v":""},{"$f":"IFERROR(VLOOKUP($N92,'Emission factors'!$C:$BQ,9,FALSE),\"\")","v":""},{"$f":"IFERROR(VLOOKUP($N92,'Emission factors'!$C:$BQ,12,FALSE),\"\")","v":""},{"$f":"IFERROR(VLOOKUP($N92,'Emission factors'!$C:$BQ,15,FALSE),\"\")","v":""},{"$f":"IFERROR(VLOOKUP($N92,'Emission factors'!$C:$BQ,65,FALSE),\"\")","v":""},{"$f":"IFERROR(VLOOKUP($N92,'Emission factors'!$C:$BQ,67,FALSE),\"\")","v":""},null,null,null,null,null,null,"","","",{"$f":"IFERROR(IF(AND($N92=\"\",$U92=\"\"),\"\",IF($N92=\"\",IF(Y92=\"\",SUM(AA92:AC92),IF(Y92=0,\"0\",Y92)),IF($S92=\"\",SUM($AA92:$AC92),IF($S92=0,\"0\",$H92*IF($L92=\"\",1,$L92)*$S92)))),\"-\")","v":""},{"$f":"IFERROR(IF(AND($N92=\"\",$U92=\"\"),\"\",IF($N92=\"\",IF(Z92=0,\"\",Z92),IF(T92=0,\"0\",$H92*IF($L92=\"\",1,$L92)*T92))),\"-\")","v":""}]
[null,"II.5.3",3,"Emissions from transboundary journeys occurring outside the city, and T&D losses from grid-supplied energy consumption",null,null,"NO",null,null,null,null,null,null,null,null,null,null,null,null,null,null,null,null,null,null,null,null,null,null,null,null,null,null,"II.5.3 does not occur"]
[null,"II.5.3",3,null,null,null,null,null,null,null,null,null,null,null,{"$f":"IFERROR(CONCATENATE(\"tCO2e/\",VLOOKUP($N94,'Emission factors'!$C:$I,6,FALSE)),\"\")","v":""},{"$f":"IFERROR(VLOOKUP($N94,'Emission factors'!$C:$BQ,9,FALSE),\"\")","v":""},{"$f":"IFERROR(VLOOKUP($N94,'Emission factors'!$C:$BQ,12,FALSE),\"\")","v":""},{"$f":"IFERROR(VLOOKUP($N94,'Emission factors'!$C:$BQ,15,FALSE),\"\")","v":""},{"$f":"IFERROR(VLOOKUP($N94,'Emission factors'!$C:$BQ,65,FALSE),\"\")","v":""},{"$f":"IFERROR(VLOOKUP($N94,'Emission factors'!$C:$BQ,67,FALSE),\"\")","v":""},null,null,null,null,null,null,{"$f":"IFERROR(IF(AND($N94=\"\",$U94=\"\"),\"\",IF($N94=\"\",IF(V94=0,\"-\",V94),IF(P94=0,\"0\",$H94*IF($L94=\"\",1,$L94)*P94))),\"-\")","v":""},"","",{"$f":"IFERROR(IF(AND($N94=\"\",$U94=\"\"),\"\",IF($N94=\"\",IF(Y94=\"\",SUM(AA94:AC94),IF(Y94=0,\"0\",Y94)),IF($S94=\"\",SUM($AA94:$AC94),IF($S94=0,\"0\",$H94*IF($L94=\"\",1,$L94)*$S94)))),\"-\")","v":""},{"$f":"IFERROR(IF(AND($N94=\"\",$U94=\"\"),\"\",IF($N94=\"\",IF(Z94=0,\"\",Z94),IF(T94=0,\"0\",$H94*IF($L94=\"\",1,$L94)*T94))),\"-\")","v":""}]
[null,"II.5.3",3,null,null,null,null,null,null,null,null,null,null,null,{"$f":"IFERROR(CONCATENATE(\"tCO2e/\",VLOOKUP($N95,'Emission factors'!$C:$I,6,FALSE)),\"\")","v":""},{"$f":"IFERROR(VLOOKUP($N95,'Emission factors'!$C:$BQ,9,FALSE),\"\")","v":""},{"$f":"IFERROR(VLOOKUP($N95,'Emission factors'!$C:$BQ,12,FALSE),\"\")","v":""},{"$f":"IFERROR(VLOOKUP($N95,'Emission factors'!$C:$BQ,15,FALSE),\"\")","v":""},{"$f":"IFERROR(VLOOKUP($N95,'Emission factors'!$C:$BQ,65,FALSE),\"\")","v":""},{"$f":"IFERROR(VLOOKUP($N95,'Emission factors'!$C:$BQ,67,FALSE),\"\")","v":""},null,null,null,null,null,null,"","","",{"$f":"IFERROR(IF(AND($N95=\"\",$U95=\"\"),\"\",IF($N95=\"\",IF(Y95=\"\",SUM(AA95:AC95),IF(Y95=0,\"0\",Y95)),IF($S95=\"\",SUM($AA95:$AC95),IF($S95=0,\"0\",$H95*IF($L95=\"\",1,$L95)*$S95)))),\"-\")","v":""},{"$f":"IFERROR(IF(AND($N95=\"\",$U95=\"\"),\"\",IF($N95=\"\",IF(Z95=0,\"\",Z95),IF(T95=0,\"0\",$H95*IF($L95=\"\",1,$L95)*T95))),\"-\")","v":""}]
[]
[null,"II. MACRO"]

{"sheet":"III - Waste","index":7,"n_rows":63,"n_cols":36,"rows_kept":63,"cut":false,"hidden":false,"merged":[[49,13,50,13],[49,12,50,12],[49,9,49,11],[49,14,49,19],[49,34,50,34],[49,20,50,20],[49,21,49,25],[49,35,50,35],[49,26,49,30],[49,31,49,32],[49,33,50,33],[7,34,8,34],[7,35,8,35],[21,34,22,34],[21,35,22,35],[35,34,36,34],[35,35,36,35],[35,31,35,32],[35,33,36,33],[35,26,35,30],[7,31,7,32],[7,33,8,33],[21,26,21,30],[59,3,59,4],[60,3,60,4],[50,3,50,4],[52,3,52,4],[53,3,53,4],[56,3,56,4],[57,3,57,4],[54,3,54,4],[49,1,50,1],[49,2,50,2],[49,6,50,6],[49,7,49,8],[49,3,49,5],[35,1,36,1],[35,2,36,2],[35,6,36,6],[35,7,35,8],[35,3,35,5],[35,21,35,25],[21,9,21,11],[21,14,21,19],[21,20,22,20],[21,21,21,25],[35,13,36,13],[35,12,36,12],[35,9,35,11],[35,14,35,19],[35,20,36,20],[21,1,22,1],[21,2,22,2],[21,6,22,6],[21,7,21,8],[21,3,21,5],[7,1,8,1],[7,2,8,2],[7,6,8,6],[7,26,7,30],[7,3,7,5],[7,13,8,13],[7,12,8,12],[7,9,7,11],[7,14,7,19],[7,20,8,20],[7,21,7,25],[7,7,7,8],[1,34,1,35],[3,7,4,8],[3,13,4,13],[3,20,4,20],[3,34,4,35],[21,31,21,32],[21,33,22,33],[21,13,22,13],[21,12,22,12],[1,7,1,8]]}
[]
[null,"III WASTE",null,null,null,null,null,"",null,null,null,null,null,"",null,null,null,null,null,null,"",null,null,null,null,null,null,null,null,null,null,null,null,null,""]
[]
[null,"Use this tab to record activity and emissions data for Waste sources. Emission factors should be recorded in the 'Emission factors' tab.",null,null,null,null,null,"Convert activity data units",null,null,null,null,null,"View emission factor(s)",null,null,null,null,null,null,"Enter emissions data",null,null,null,null,null,null,null,null,null,null,null,null,null,"Data quality explanation (optional)"]
[]
[null,"III.1 SOLID WASTE DISPOSAL"]
[]
[null,"GPC ref No.","Scope","GHG Emissions Source",null,null,"Notation \nkeys","Activity data",null,"Activity data multiplier",null,null,"Gas(es)","Emission factor","Emission factor",null,null,null,null,null,"Emissions data","GHGs (metric tonnes CO2e)",null,null,null,null,"GHGs (metric tonnes CO2e)",null,null,null,null,"Data Quality",null,"Description of method(s) used or explanation for using notation key(s)","Source","Data quality explanation (optional)"]
[null,null,null,"Activity","Waste type","Description",null,"Amount","Units","From","To","Factor",null,null,"Units","CO2","CH4","N2O","Total tCO2e","CO2(b)",null,"CO2","CH4","N2O","Total tCO2e","CO2(b)","CO2","CH4","N2O","Total tCO2e","CO2(b)","AD","EF"]
[null,"III.1.1",1,"Emissions from solid waste generated in the city and disposed in landfills or open dumps within the city  "]
[null,"III.1.1",1,"Landfill sites - First order decay","Municipal solid waste",null,null,null,null,null,null,null,null,null,{"$f":"IFERROR(CONCATENATE(\"tCO2e/\",VLOOKUP($N11,'Emission factors'!$C:$I,6,FALSE)),\"\")","v":""},{"$f":"IFERROR(VLOOKUP($N11,'Emission factors'!$C:$BQ,9,FALSE),\"\")","v":""},{"$f":"IFERROR(VLOOKUP($N11,'Emission factors'!$C:$BQ,12,FALSE),\"\")","v":""},{"$f":"IFERROR(VLOOKUP($N11,'Emission factors'!$C:$BQ,15,FALSE),\"\")","v":""},{"$f":"IFERROR(VLOOKUP($N11,'Emission factors'!$C:$BQ,65,FALSE),\"\")","v":""},{"$f":"IFERROR(VLOOKUP($N11,'Emission factors'!$C:$BQ,67,FALSE),\"\")","v":""},"✓",null,{"$f":"[7]Summary!$B$21","v":1291449.0378922205},null,null,null,{"$f":"IFERROR(IF(AND($N11=\"\",$U11=\"\"),\"\",IF($N11=\"\",IF(V11=0,\"-\",V11),IF(P11=0,\"0\",$H11*IF($L11=\"\",1,$L11)*P11))),\"-\")","v":"-"},1291449.0378922205,"-",{"$f":"IFERROR(IF(AND($N11=\"\",$U11=\"\"),\"\",IF($N11=\"\",IF(Y11=\"\",SUM(AA11:AC11),IF(Y11=0,\"0\",Y11)),IF($S11=\"\",SUM($AA11:$AC11),IF($S11=0,\"0\",$H11*IF($L11=\"\",1,$L11)*$S11)))),\"-\")","v":1291449.0378922205},{"$f":"IFERROR(IF(AND($N11=\"\",$U11=\"\"),\"\",IF($N11=\"\",IF(Z11=0,\"-\",Z11),IF(T11=0,\"0\",$H11*IF($L11=\"\",1,$L11)*T11))),\"-\")","v":"-"}]
[null,"III.1.1",1,null,null,null,null,null,null,null,null,null,null,null,{"$f":"IFERROR(CONCATENATE(\"tCO2e/\",VLOOKUP($N12,'Emission factors'!$C:$I,6,FALSE)),\"\")","v":""},{"$f":"IFERROR(VLOOKUP($N12,'Emission factors'!$C:$BQ,9,FALSE),\"\")","v":""},{"$f":"IFERROR(VLOOKUP($N12,'Emission factors'!$C:$BQ,12,FALSE),\"\")","v":""},{"$f":"IFERROR(VLOOKUP($N12,'Emission factors'!$C:$BQ,15,FALSE),\"\")","v":""},{"$f":"IFERROR(VLOOKUP($N12,'Emission factors'!$C:$BQ,65,FALSE),\"\")","v":""},{"$f":"IFERROR(VLOOKUP($N12,'Emission factors'!$C:$BQ,67,FALSE),\"\")","v":""},null,null,null,null,null,null,"","","",{"$f":"IFERROR(IF(AND($N12=\"\",$U12=\"\"),\"\",IF($N12=\"\",IF(Y12=\"\",SUM(AA12:AC12),IF(Y12=0,\"0\",Y12)),IF($S12=\"\",SUM($AA12:$AC12),IF($S12=0,\"0\",$H12*IF($L12=\"\",1,$L12)*$S12)))),\"-\")","v":""},{"$f":"IFERROR(IF(AND($N12=\"\",$U12=\"\"),\"\",IF($N12=\"\",IF(Z12=0,\"-\",Z12),IF(T12=0,\"0\",$H12*IF($L12=\"\",1,$L12)*T12))),\"-\")","v":""}]
[null,"III.1.2",3,"Emissions from solid waste generated in the city but disposed in landfills or open dumps outside the city  ",null,null,"NO"]
[null,"III.1.2",3,null,null,null,null,null,null,null,null,null,null,null,{"$f":"IFERROR(CONCATENATE(\"tCO2e/\",VLOOKUP($N14,'Emission factors'!$C:$I,6,FALSE)),\"\")","v":""},{"$f":"IFERROR(VLOOKUP($N14,'Emission factors'!$C:$BQ,9,FALSE),\"\")","v":""},{"$f":"IFERROR(VLOOKUP($N14,'Emission factors'!$C:$BQ,12,FALSE),\"\")","v":""},{"$f":"IFERROR(VLOOKUP($N14,'Emission factors'!$C:$BQ,15,FALSE),\"\")","v":""},{"$f":"IFERROR(VLOOKUP($N14,'Emission factors'!$C:$BQ,65,FALSE),\"\")","v":""},{"$f":"IFERROR(VLOOKUP($N14,'Emission factors'!$C:$BQ,67,FALSE),\"\")","v":""},null,null,null,null,null,null,{"$f":"IFERROR(IF(AND($N14=\"\",$U14=\"\"),\"\",IF($N14=\"\",IF(V14=0,\"-\",V14),IF(P14=0,\"0\",$H14*IF($L14=\"\",1,$L14)*P14))),\"-\")","v":""},"","",{"$f":"IFERROR(IF(AND($N14=\"\",$U14=\"\"),\"\",IF($N14=\"\",IF(Y14=\"\",SUM(AA14:AC14),IF(Y14=0,\"0\",Y14)),IF($S14=\"\",SUM($AA14:$AC14),IF($S14=0,\"0\",$H14*IF($L14=\"\",1,$L14)*$S14)))),\"-\")","v":""},{"$f":"IFERROR(IF(AND($N14=\"\",$U14=\"\"),\"\",IF($N14=\"\",IF(Z14=0,\"-\",Z14),IF(T14=0,\"0\",$H14*IF($L14=\"\",1,$L14)*T14))),\"-\")","v":""}]
[null,"III.1.2",3,null,null,null,null,null,null,null,null,null,null,null,{"$f":"IFERROR(CONCATENATE(\"tCO2e/\",VLOOKUP($N15,'Emission factors'!$C:$I,6,FALSE)),\"\")","v":""},{"$f":"IFERROR(VLOOKUP($N15,'Emission factors'!$C:$BQ,9,FALSE),\"\")","v":""},{"$f":"IFERROR(VLOOKUP($N15,'Emission factors'!$C:$BQ,12,FALSE),\"\")","v":""},{"$f":"IFERROR(VLOOKUP($N15,'Emission factors'!$C:$BQ,15,FALSE),\"\")","v":""},{"$f":"IFERROR(VLOOKUP($N15,'Emission factors'!$C:$BQ,65,FALSE),\"\")","v":""},{"$f":"IFERROR(VLOOKUP($N15,'Emission factors'!$C:$BQ,67,FALSE),\"\")","v":""},null,null,null,null,null,null,"","","",{"$f":"IFERROR(IF(AND($N15=\"\",$U15=\"\"),\"\",IF($N15=\"\",IF(Y15=\"\",SUM(AA15:AC15),IF(Y15=0,\"0\",Y15)),IF($S15=\"\",SUM($AA15:$AC15),IF($S15=0,\"0\",$H15*IF($L15=\"\",1,$L15)*$S15)))),\"-\")","v":""},{"$f":"IFERROR(IF(AND($N15=\"\",$U15=\"\"),\"\",IF($N15=\"\",IF(Z15=0,\"-\",Z15),IF(T15=0,\"0\",$H15*IF($L15=\"\",1,$L15)*T15))),\"-\")","v":""}]
[null,"III.1.3",1,"Emissions from waste generated outside the city and disposed in landfills or open dumps within the city  ",null,null,"NO"]
[null,"III.1.3",1,null,null,null,null,null,null,null,null,null,null,null,{"$f":"IFERROR(CONCATENATE(\"tCO2e/\",VLOOKUP($N17,'Emission factors'!$C:$I,6,FALSE)),\"\")","v":""},{"$f":"IFERROR(VLOOKUP($N17,'Emission factors'!$C:$BQ,9,FALSE),\"\")","v":""},{"$f":"IFERROR(VLOOKUP($N17,'Emission factors'!$C:$BQ,12,FALSE),\"\")","v":""},{"$f":"IFERROR(VLOOKUP($N17,'Emission factors'!$C:$BQ,15,FALSE),\"\")","v":""},{"$f":"IFERROR(VLOOKUP($N17,'Emission factors'!$C:$BQ,65,FALSE),\"\")","v":""},{"$f":"IFERROR(VLOOKUP($N17,'Emission factors'!$C:$BQ,67,FALSE),\"\")","v":""},null,null,null,null,null,null,{"$f":"IFERROR(IF(AND($N17=\"\",$U17=\"\"),\"\",IF($N17=\"\",IF(V17=0,\"-\",V17),IF(P17=0,\"0\",$H17*IF($L17=\"\",1,$L17)*P17))),\"-\")","v":""},"","",{"$f":"IFERROR(IF(AND($N17=\"\",$U17=\"\"),\"\",IF($N17=\"\",IF(Y17=\"\",SUM(AA17:AC17),IF(Y17=0,\"0\",Y17)),IF($S17=\"\",SUM($AA17:$AC17),IF($S17=0,\"0\",$H17*IF($L17=\"\",1,$L17)*$S17)))),\"-\")","v":""},{"$f":"IFERROR(IF(AND($N17=\"\",$U17=\"\"),\"\",IF($N17=\"\",IF(Z17=0,\"-\",Z17),IF(T17=0,\"0\",$H17*IF($L17=\"\",1,$L17)*T17))),\"-\")","v":""}]
[null,"III.1.3",1,null,null,null,null,null,null,null,null,null,null,null,{"$f":"IFERROR(CONCATENATE(\"tCO2e/\",VLOOKUP($N18,'Emission factors'!$C:$I,6,FALSE)),\"\")","v":""},{"$f":"IFERROR(VLOOKUP($N18,'Emission factors'!$C:$BQ,9,FALSE),\"\")","v":""},{"$f":"IFERROR(VLOOKUP($N18,'Emission factors'!$C:$BQ,12,FALSE),\"\")","v":""},{"$f":"IFERROR(VLOOKUP($N18,'Emission factors'!$C:$BQ,15,FALSE),\"\")","v":""},{"$f":"IFERROR(VLOOKUP($N18,'Emission factors'!$C:$BQ,65,FALSE),\"\")","v":""},{"$f":"IFERROR(VLOOKUP($N18,'Emission factors'!$C:$BQ,67,FALSE),\"\")","v":""},null,null,null,null,null,null,"","","",{"$f":"IFERROR(IF(AND($N18=\"\",$U18=\"\"),\"\",IF($N18=\"\",IF(Y18=\"\",SUM(AA18:AC18),IF(Y18=0,\"0\",Y18)),IF($S18=\"\",SUM($AA18:$AC18),IF($S18=0,\"0\",$H18*IF($L18=\"\",1,$L18)*$S18)))),\"-\")","v":""},{"$f":"IFERROR(IF(AND($N18=\"\",$U18=\"\"),\"\",IF($N18=\"\",IF(Z18=0,\"-\",Z18),IF(T18=0,\"0\",$H18*IF($L18=\"\",1,$L18)*T18))),\"-\")","v":""}]
[]
[null,"III.2 BIOLOGICAL TREATMENT OF WASTE"]
[]
[null,"GPC ref No.","Scope","GHG Emissions Source",null,null,"Notation \nkeys","Activity data",null,"Activity data multiplier",null,null,"Gas(es)","Emission factor","Emission factor",null,null,null,null,null,"Emissions data","GHGs (metric tonnes CO2e)",null,null,null,null,"GHGs (metric tonnes CO2e)",null,null,null,null,"Data Quality",null,"Description of method(s) used or explanation for using notation key(s)","Source","Data quality explanation (optional)"]
[null,null,null,"Activity","Waste type","Description",null,"Amount","Units","From","To","Factor",null,null,"Units","CO2","CH4","N2O","Total tCO2e","CO2(b)",null,"CO2","CH4","N2O","Total tCO2e","CO2(b)","CO2","CH4","N2O","Total tCO2e","CO2(b)","AD","EF"]
[null,"III.2.1",1,"Emissions from solid waste generated in the city that is treated biologically in the city",null,null,"NO"]
[null,"III.2.1",1,null,null,null,null,null,null,null,null,null,null,null,{"$f":"IFERROR(CONCATENATE(\"tCO2e/\",VLOOKUP($N25,'Emission factors'!$C:$I,6,FALSE)),\"\")","v":""},{"$f":"IFERROR(VLOOKUP($N25,'Emission factors'!$C:$BQ,9,FALSE),\"\")","v":""},{"$f":"IFERROR(VLOOKUP($N25,'Emission factors'!$C:$BQ,12,FALSE),\"\")","v":""},{"$f":"IFERROR(VLOOKUP($N25,'Emission factors'!$C:$BQ,15,FALSE),\"\")","v":""},{"$f":"IFERROR(VLOOKUP($N25,'Emission factors'!$C:$BQ,65,FALSE),\"\")","v":""},{"$f":"IFERROR(VLOOKUP($N25,'Emission factors'!$C:$BQ,67,FALSE),\"\")","v":""},null,null,null,null,null,null,{"$f":"IFERROR(IF(AND($N25=\"\",$U25=\"\"),\"\",IF($N25=\"\",IF(V25=0,\"-\",V25),IF(P25=0,\"0\",$H25*IF($L25=\"\",1,$L25)*P25))),\"-\")","v":""},"","",{"$f":"IFERROR(IF(AND($N25=\"\",$U25=\"\"),\"\",IF($N25=\"\",IF(Y25=\"\",SUM(AA25:AC25),IF(Y25=0,\"0\",Y25)),IF($S25=\"\",SUM($AA25:$AC25),IF($S25=0,\"0\",$H25*IF($L25=\"\",1,$L25)*$S25)))),\"-\")","v":""},{"$f":"IFERROR(IF(AND($N25=\"\",$U25=\"\"),\"\",IF($N25=\"\",IF(Z25=0,\"-\",Z25),IF(T25=0,\"0\",$H25*IF($L25=\"\",1,$L25)*T25))),\"-\")","v":""}]
[null,"III.2.1",1,null,null,null,null,null,null,null,null,null,null,null,{"$f":"IFERROR(CONCATENATE(\"tCO2e/\",VLOOKUP($N26,'Emission factors'!$C:$I,6,FALSE)),\"\")","v":""},{"$f":"IFERROR(VLOOKUP($N26,'Emission factors'!$C:$BQ,9,FALSE),\"\")","v":""},{"$f":"IFERROR(VLOOKUP($N26,'Emission factors'!$C:$BQ,12,FALSE),\"\")","v":""},{"$f":"IFERROR(VLOOKUP($N26,'Emission factors'!$C:$BQ,15,FALSE),\"\")","v":""},{"$f":"IFERROR(VLOOKUP($N26,'Emission factors'!$C:$BQ,65,FALSE),\"\")","v":""},{"$f":"IFERROR(VLOOKUP($N26,'Emission factors'!$C:$BQ,67,FALSE),\"\")","v":""},null,null,null,null,null,null,"","","",{"$f":"IFERROR(IF(AND($N26=\"\",$U26=\"\"),\"\",IF($N26=\"\",IF(Y26=\"\",SUM(AA26:AC26),IF(Y26=0,\"0\",Y26)),IF($S26=\"\",SUM($AA26:$AC26),IF($S26=0,\"0\",$H26*IF($L26=\"\",1,$L26)*$S26)))),\"-\")","v":""},{"$f":"IFERROR(IF(AND($N26=\"\",$U26=\"\"),\"\",IF($N26=\"\",IF(Z26=0,\"-\",Z26),IF(T26=0,\"0\",$H26*IF($L26=\"\",1,$L26)*T26))),\"-\")","v":""}]
[null,"III.2.2",3,"Emissions from solid waste generated in the city but treated biologically outside of the city ",null,null,"NO"]
[null,"III.2.2",3,null,null,null,null,null,null,null,null,null,null,null,{"$f":"IFERROR(CONCATENATE(\"tCO2e/\",VLOOKUP($N28,'Emission factors'!$C:$I,6,FALSE)),\"\")","v":""},{"$f":"IFERROR(VLOOKUP($N28,'Emission factors'!$C:$BQ,9,FALSE),\"\")","v":""},{"$f":"IFERROR(VLOOKUP($N28,'Emission factors'!$C:$BQ,12,FALSE),\"\")","v":""},{"$f":"IFERROR(VLOOKUP($N28,'Emission factors'!$C:$BQ,15,FALSE),\"\")","v":""},{"$f":"IFERROR(VLOOKUP($N28,'Emission factors'!$C:$BQ,65,FALSE),\"\")","v":""},{"$f":"IFERROR(VLOOKUP($N28,'Emission factors'!$C:$BQ,67,FALSE),\"\")","v":""},null,null,null,null,null,null,{"$f":"IFERROR(IF(AND($N28=\"\",$U28=\"\"),\"\",IF($N28=\"\",IF(V28=0,\"-\",V28),IF(P28=0,\"0\",$H28*IF($L28=\"\",1,$L28)*P28))),\"-\")","v":""},"","",{"$f":"IFERROR(IF(AND($N28=\"\",$U28=\"\"),\"\",IF($N28=\"\",IF(Y28=\"\",SUM(AA28:AC28),IF(Y28=0,\"0\",Y28)),IF($S28=\"\",SUM($AA28:$AC28),IF($S28=0,\"0\",$H28*IF($L28=\"\",1,$L28)*$S28)))),\"-\")","v":""},{"$f":"IFERROR(IF(AND($N28=\"\",$U28=\"\"),\"\",IF($N28=\"\",IF(Z28=0,\"-\",Z28),IF(T28=0,\"0\",$H28*IF($L28=\"\",1,$L28)*T28))),\"-\")","v":""}]
[null,"III.2.2",3,null,null,null,null,null,null,null,null,null,null,null,{"$f":"IFERROR(CONCATENATE(\"tCO2e/\",VLOOKUP($N29,'Emission factors'!$C:$I,6,FALSE)),\"\")","v":""},{"$f":"IFERROR(VLOOKUP($N29,'Emission factors'!$C:$BQ,9,FALSE),\"\")","v":""},{"$f":"IFERROR(VLOOKUP($N29,'Emission factors'!$C:$BQ,12,FALSE),\"\")","v":""},{"$f":"IFERROR(VLOOKUP($N29,'Emission factors'!$C:$BQ,15,FALSE),\"\")","v":""},{"$f":"IFERROR(VLOOKUP($N29,'Emission factors'!$C:$BQ,65,FALSE),\"\")","v":""},{"$f":"IFERROR(VLOOKUP($N29,'Emission factors'!$C:$BQ,67,FALSE),\"\")","v":""},null,null,null,null,null,null,"","","",{"$f":"IFERROR(IF(AND($N29=\"\",$U29=\"\"),\"\",IF($N29=\"\",IF(Y29=\"\",SUM(AA29:AC29),IF(Y29=0,\"0\",Y29)),IF($S29=\"\",SUM($AA29:$AC29),IF($S29=0,\"0\",$H29*IF($L29=\"\",1,$L29)*$S29)))),\"-\")","v":""},{"$f":"IFERROR(IF(AND($N29=\"\",$U29=\"\"),\"\",IF($N29=\"\",IF(Z29=0,\"-\",Z29),IF(T29=0,\"0\",$H29*IF($L29=\"\",1,$L29)*T29))),\"-\")","v":""}]
[null,"III.2.3",1,"Emissions from waste generated outside the city boundary but treated in the city",null,null,"NO"]
[null,"III.2.3",1,null,null,null,null,null,null,null,null,null,null,null,{"$f":"IFERROR(CONCATENATE(\"tCO2e/\",VLOOKUP($N31,'Emission factors'!$C:$I,6,FALSE)),\"\")","v":""},{"$f":"IFERROR(VLOOKUP($N31,'Emission factors'!$C:$BQ,9,FALSE),\"\")","v":""},{"$f":"IFERROR(VLOOKUP($N31,'Emission factors'!$C:$BQ,12,FALSE),\"\")","v":""},{"$f":"IFERROR(VLOOKUP($N31,'Emission factors'!$C:$BQ,15,FALSE),\"\")","v":""},{"$f":"IFERROR(VLOOKUP($N31,'Emission factors'!$C:$BQ,65,FALSE),\"\")","v":""},{"$f":"IFERROR(VLOOKUP($N31,'Emission factors'!$C:$BQ,67,FALSE),\"\")","v":""},null,null,null,null,null,null,{"$f":"IFERROR(IF(AND($N31=\"\",$U31=\"\"),\"\",IF($N31=\"\",IF(V31=0,\"-\",V31),IF(P31=0,\"0\",$H31*IF($L31=\"\",1,$L31)*P31))),\"-\")","v":""},"","",{"$f":"IFERROR(IF(AND($N31=\"\",$U31=\"\"),\"\",IF($N31=\"\",IF(Y31=\"\",SUM(AA31:AC31),IF(Y31=0,\"0\",Y31)),IF($S31=\"\",SUM($AA31:$AC31),IF($S31=0,\"0\",$H31*IF($L31=\"\",1,$L31)*$S31)))),\"-\")","v":""},{"$f":"IFERROR(IF(AND($N31=\"\",$U31=\"\"),\"\",IF($N31=\"\",IF(Z31=0,\"-\",Z31),IF(T31=0,\"0\",$H31*IF($L31=\"\",1,$L31)*T31))),\"-\")","v":""}]
[null,"III.2.3",1,null,null,null,null,null,null,null,null,null,null,null,{"$f":"IFERROR(CONCATENATE(\"tCO2e/\",VLOOKUP($N32,'Emission factors'!$C:$I,6,FALSE)),\"\")","v":""},{"$f":"IFERROR(VLOOKUP($N32,'Emission factors'!$C:$BQ,9,FALSE),\"\")","v":""},{"$f":"IFERROR(VLOOKUP($N32,'Emission factors'!$C:$BQ,12,FALSE),\"\")","v":""},{"$f":"IFERROR(VLOOKUP($N32,'Emission factors'!$C:$BQ,15,FALSE),\"\")","v":""},{"$f":"IFERROR(VLOOKUP($N32,'Emission factors'!$C:$BQ,65,FALSE),\"\")","v":""},{"$f":"IFERROR(VLOOKUP($N32,'Emission factors'!$C:$BQ,67,FALSE),\"\")","v":""},null,null,null,null,null,null,"","","",{"$f":"IFERROR(IF(AND($N32=\"\",$U32=\"\"),\"\",IF($N32=\"\",IF(Y32=\"\",SUM(AA32:AC32),IF(Y32=0,\"0\",Y32)),IF($S32=\"\",SUM($AA32:$AC32),IF($S32=0,\"0\",$H32*IF($L32=\"\",1,$L32)*$S32)))),\"-\")","v":""},{"$f":"IFERROR(IF(AND($N32=\"\",$U32=\"\"),\"\",IF($N32=\"\",IF(Z32=0,\"-\",Z32),IF(T32=0,\"0\",$H32*IF($L32=\"\",1,$L32)*T32))),\"-\")","v":""}]
[]
[null,"III.3 INCINERATION AND OPEN BURNING"]
[]
[null,"GPC ref No.","Scope","GHG Emissions Source",null,null,"Notation \nkeys","Activity data",null,"Activity data multiplier",null,null,"Gas(es)","Emission factor","Emission factor",null,null,null,null,null,"Emissions data","GHGs (metric tonnes CO2e)",null,null,null,null,"GHGs (metric tonnes CO2e)",null,null,null,null,"Data Quality",null,"Description of method(s) used or explanation for using notation key(s)","Source","Data quality explanation (optional)"]
[null,null,null,"Activity","Waste type","Description",null,"Amount","Units","From","To","Factor",null,null,"Units","CO2","CH4","N2O","Total tCO2e","CO2(b)",null,"CO2","CH4","N2O","Total tCO2e","CO2(b)","CO2","CH4","N2O","Total tCO2e","CO2(b)","AD","EF"]
[null,"III.3.1",1,"Emissions from waste generated and treated within the city  ",null,null,"NO"]
[null,"III.3.1",1," ",null,null,null,null,null,null,null,null,null,null,{"$f":"IFERROR(CONCATENATE(\"tCO2e/\",VLOOKUP($N39,'Emission factors'!$C:$I,6,FALSE)),\"\")","v":""},{"$f":"IFERROR(VLOOKUP($N39,'Emission factors'!$C:$BQ,9,FALSE),\"\")","v":""},{"$f":"IFERROR(VLOOKUP($N39,'Emission factors'!$C:$BQ,12,FALSE),\"\")","v":""},{"$f":"IFERROR(VLOOKUP($N39,'Emission factors'!$C:$BQ,15,FALSE),\"\")","v":""},{"$f":"IFERROR(VLOOKUP($N39,'Emission factors'!$C:$BQ,65,FALSE),\"\")","v":""},{"$f":"IFERROR(VLOOKUP($N39,'Emission factors'!$C:$BQ,67,FALSE),\"\")","v":""},null,null,null,null,null,null,{"$f":"IFERROR(IF(AND($N39=\"\",$U39=\"\"),\"\",IF($N39=\"\",IF(V39=0,\"-\",V39),IF(P39=0,\"0\",$H39*IF($L39=\"\",1,$L39)*P39))),\"-\")","v":""},"","",{"$f":"IFERROR(IF(AND($N39=\"\",$U39=\"\"),\"\",IF($N39=\"\",IF(Y39=\"\",SUM(AA39:AC39),IF(Y39=0,\"0\",Y39)),IF($S39=\"\",SUM($AA39:$AC39),IF($S39=0,\"0\",$H39*IF($L39=\"\",1,$L39)*$S39)))),\"-\")","v":""},{"$f":"IFERROR(IF(AND($N39=\"\",$U39=\"\"),\"\",IF($N39=\"\",IF(Z39=0,\"-\",Z39),IF(T39=0,\"0\",$H39*IF($L39=\"\",1,$L39)*T39))),\"-\")","v":""}]
[null,"III.3.1",1," ",null,null,null,null,null,null,null,null,null,null,{"$f":"IFERROR(CONCATENATE(\"tCO2e/\",VLOOKUP($N40,'Emission factors'!$C:$I,6,FALSE)),\"\")","v":""},{"$f":"IFERROR(VLOOKUP($N40,'Emission factors'!$C:$BQ,9,FALSE),\"\")","v":""},{"$f":"IFERROR(VLOOKUP($N40,'Emission factors'!$C:$BQ,12,FALSE),\"\")","v":""},{"$f":"IFERROR(VLOOKUP($N40,'Emission factors'!$C:$BQ,15,FALSE),\"\")","v":""},{"$f":"IFERROR(VLOOKUP($N40,'Emission factors'!$C:$BQ,65,FALSE),\"\")","v":""},{"$f":"IFERROR(VLOOKUP($N40,'Emission factors'!$C:$BQ,67,FALSE),\"\")","v":""},null,null,null,null,null,null,"","","",{"$f":"IFERROR(IF(AND($N40=\"\",$U40=\"\"),\"\",IF($N40=\"\",IF(Y40=\"\",SUM(AA40:AC40),IF(Y40=0,\"0\",Y40)),IF($S40=\"\",SUM($AA40:$AC40),IF($S40=0,\"0\",$H40*IF($L40=\"\",1,$L40)*$S40)))),\"-\")","v":""},{"$f":"IFERROR(IF(AND($N40=\"\",$U40=\"\"),\"\",IF($N40=\"\",IF(Z40=0,\"-\",Z40),IF(T40=0,\"0\",$H40*IF($L40=\"\",1,$L40)*T40))),\"-\")","v":""}]
[null,"III.3.2",3,"Emissions from waste generated within but treated outside of the city ",null,null,"NO"]
[null,"III.3.2",3," ",null,null,null,null,null,null,null,null,null,null,{"$f":"IFERROR(CONCATENATE(\"tCO2e/\",VLOOKUP($N42,'Emission factors'!$C:$I,6,FALSE)),\"\")","v":""},{"$f":"IFERROR(VLOOKUP($N42,'Emission factors'!$C:$BQ,9,FALSE),\"\")","v":""},{"$f":"IFERROR(VLOOKUP($N42,'Emission factors'!$C:$BQ,12,FALSE),\"\")","v":""},{"$f":"IFERROR(VLOOKUP($N42,'Emission factors'!$C:$BQ,15,FALSE),\"\")","v":""},{"$f":"IFERROR(VLOOKUP($N42,'Emission factors'!$C:$BQ,65,FALSE),\"\")","v":""},{"$f":"IFERROR(VLOOKUP($N42,'Emission factors'!$C:$BQ,67,FALSE),\"\")","v":""},null,null,null,null,null,null,{"$f":"IFERROR(IF(AND($N42=\"\",$U42=\"\"),\"\",IF($N42=\"\",IF(V42=0,\"-\",V42),IF(P42=0,\"0\",$H42*IF($L42=\"\",1,$L42)*P42))),\"-\")","v":""},"","",{"$f":"IFERROR(IF(AND($N42=\"\",$U42=\"\"),\"\",IF($N42=\"\",IF(Y42=\"\",SUM(AA42:AC42),IF(Y42=0,\"0\",Y42)),IF($S42=\"\",SUM($AA42:$AC42),IF($S42=0,\"0\",$H42*IF($L42=\"\",1,$L42)*$S42)))),\"-\")","v":""},{"$f":"IFERROR(IF(AND($N42=\"\",$U42=\"\"),\"\",IF($N42=\"\",IF(Z42=0,\"-\",Z42),IF(T42=0,\"0\",$H42*IF($L42=\"\",1,$L42)*T42))),\"-\")","v":""}]
[null,"III.3.2",3," ",null,null,null,null,null,null,null,null,null,null,{"$f":"IFERROR(CONCATENATE(\"tCO2e/\",VLOOKUP($N43,'Emission factors'!$C:$I,6,FALSE)),\"\")","v":""},{"$f":"IFERROR(VLOOKUP($N43,'Emission factors'!$C:$BQ,9,FALSE),\"\")","v":""},{"$f":"IFERROR(VLOOKUP($N43,'Emission factors'!$C:$BQ,12,FALSE),\"\")","v":""},{"$f":"IFERROR(VLOOKUP($N43,'Emission factors'!$C:$BQ,15,FALSE),\"\")","v":""},{"$f":"IFERROR(VLOOKUP($N43,'Emission factors'!$C:$BQ,65,FALSE),\"\")","v":""},{"$f":"IFERROR(VLOOKUP($N43,'Emission factors'!$C:$BQ,67,FALSE),\"\")","v":""},null,null,null,null,null,null,"","","",{"$f":"IFERROR(IF(AND($N43=\"\",$U43=\"\"),\"\",IF($N43=\"\",IF(Y43=\"\",SUM(AA43:AC43),IF(Y43=0,\"0\",Y43)),IF($S43=\"\",SUM($AA43:$AC43),IF($S43=0,\"0\",$H43*IF($L43=\"\",1,$L43)*$S43)))),\"-\")","v":""},{"$f":"IFERROR(IF(AND($N43=\"\",$U43=\"\"),\"\",IF($N43=\"\",IF(Z43=0,\"-\",Z43),IF(T43=0,\"0\",$H43*IF($L43=\"\",1,$L43)*T43))),\"-\")","v":""}]
[null,"III.3.3",1,"Emissions from waste generated outside the city boundary but treated within the city",null,null,"NO"]
[null,"III.3.3",1," ",null,null,null,null,null,null,null,null,null,null,{"$f":"IFERROR(CONCATENATE(\"tCO2e/\",VLOOKUP($N45,'Emission factors'!$C:$I,6,FALSE)),\"\")","v":""},{"$f":"IFERROR(VLOOKUP($N45,'Emission factors'!$C:$BQ,9,FALSE),\"\")","v":""},{"$f":"IFERROR(VLOOKUP($N45,'Emission factors'!$C:$BQ,12,FALSE),\"\")","v":""},{"$f":"IFERROR(VLOOKUP($N45,'Emission factors'!$C:$BQ,15,FALSE),\"\")","v":""},{"$f":"IFERROR(VLOOKUP($N45,'Emission factors'!$C:$BQ,65,FALSE),\"\")","v":""},{"$f":"IFERROR(VLOOKUP($N45,'Emission factors'!$C:$BQ,67,FALSE),\"\")","v":""},null,null,null,null,null,null,{"$f":"IFERROR(IF(AND($N45=\"\",$U45=\"\"),\"\",IF($N45=\"\",IF(V45=0,\"-\",V45),IF(P45=0,\"0\",$H45*IF($L45=\"\",1,$L45)*P45))),\"-\")","v":""},"","",{"$f":"IFERROR(IF(AND($N45=\"\",$U45=\"\"),\"\",IF($N45=\"\",IF(Y45=\"\",SUM(AA45:AC45),IF(Y45=0,\"0\",Y45)),IF($S45=\"\",SUM($AA45:$AC45),IF($S45=0,\"0\",$H45*IF($L45=\"\",1,$L45)*$S45)))),\"-\")","v":""},{"$f":"IFERROR(IF(AND($N45=\"\",$U45=\"\"),\"\",IF($N45=\"\",IF(Z45=0,\"-\",Z45),IF(T45=0,\"0\",$H45*IF($L45=\"\",1,$L45)*T45))),\"-\")","v":""}]
[null,"III.3.3",1," ",null,null,null,null,null,null,null,null,null,null,{"$f":"IFERROR(CONCATENATE(\"tCO2e/\",VLOOKUP($N46,'Emission factors'!$C:$I,6,FALSE)),\"\")","v":""},{"$f":"IFERROR(VLOOKUP($N46,'Emission factors'!$C:$BQ,9,FALSE),\"\")","v":""},{"$f":"IFERROR(VLOOKUP($N46,'Emission factors'!$C:$BQ,12,FALSE),\"\")","v":""},{"$f":"IFERROR(VLOOKUP($N46,'Emission factors'!$C:$BQ,15,FALSE),\"\")","v":""},{"$f":"IFERROR(VLOOKUP($N46,'Emission factors'!$C:$BQ,65,FALSE),\"\")","v":""},{"$f":"IFERROR(VLOOKUP($N46,'Emission factors'!$C:$BQ,67,FALSE),\"\")","v":""},null,null,null,null,null,null,"","","",{"$f":"IFERROR(IF(AND($N46=\"\",$U46=\"\"),\"\",IF($N46=\"\",IF(Y46=\"\",SUM(AA46:AC46),IF(Y46=0,\"0\",Y46)),IF($S46=\"\",SUM($AA46:$AC46),IF($S46=0,\"0\",$H46*IF($L46=\"\",1,$L46)*$S46)))),\"-\")","v":""},{"$f":"IFERROR(IF(AND($N46=\"\",$U46=\"\"),\"\",IF($N46=\"\",IF(Z46=0,\"-\",Z46),IF(T46=0,\"0\",$H46*IF($L46=\"\",1,$L46)*T46))),\"-\")","v":""}]
[]
[null,"III.4 WASTEWATER TREATMENT AND DISCHARGE"]
[]
[null,"GPC ref No.","Scope","GHG Emissions Source",null,null,"Notation \nkeys","Activity data",null,"Activity data multiplier",null,null,"Gas(es)","Emission factor","Emission factor",null,null,null,null,null,"Emissions data","GHGs (metric tonnes CO2e)",null,null,null,null,"GHGs (metric tonnes CO2e)",null,null,null,null,"Data Quality",null,"Description of method(s) used or explanation for using notation key(s)","Source","Data quality explanation (optional)"]
[null,null,null,"Activity",null,"Description",null,"Amount","Units","From","To","Factor",null,null,"Units","CO2","CH4","N2O","Total tCO2e","CO2(b)",null,"CO2","CH4","N2O","Total tCO2e","CO2(b)","CO2","CH4","N2O","Total tCO2e","CO2(b)","AD","EF"]
[null,"III.4.1",1,"Emissions from wastewater generated and treated within the city  "]
[null,"III.4.1",1,"All wastewater",null,"Methane from incomplete combustion of anaerobic digester gas",null,null,null,null,null,null,"CH4",null,{"$f":"IFERROR(CONCATENATE(\"tCO2e/\",VLOOKUP($N53,'Emission factors'!$C:$I,6,FALSE)),\"\")","v":""},{"$f":"IFERROR(VLOOKUP($N53,'Emission factors'!$C:$BQ,9,FALSE),\"\")","v":""},{"$f":"IFERROR(VLOOKUP($N53,'Emission factors'!$C:$BQ,12,FALSE),\"\")","v":""},{"$f":"IFERROR(VLOOKUP($N53,'Emission factors'!$C:$BQ,15,FALSE),\"\")","v":""},{"$f":"IFERROR(VLOOKUP($N53,'Emission factors'!$C:$BQ,65,FALSE),\"\")","v":""},{"$f":"IFERROR(VLOOKUP($N53,'Emission factors'!$C:$BQ,67,FALSE),\"\")","v":""},"✓",null,{"$f":"[5]Emissions!$B$24*21/1000","v":2341.5010102881142},null,null,null,{"$f":"IFERROR(IF(AND($N53=\"\",$U53=\"\"),\"\",IF($N53=\"\",IF(V53=0,\"-\",V53),IF(P53=0,\"0\",$H53*IF($L53=\"\",1,$L53)*P53))),\"-\")","v":"-"},2341.5010102881142,"-",{"$f":"IFERROR(IF(AND($N53=\"\",$U53=\"\"),\"\",IF($N53=\"\",IF(Y53=\"\",SUM(AA53:AC53),IF(Y53=0,\"0\",Y53)),IF($S53=\"\",SUM($AA53:$AC53),IF($S53=0,\"0\",$H53*IF($L53=\"\",1,$L53)*$S53)))),\"-\")","v":2341.5010102881142},{"$f":"IFERROR(IF(AND($N53=\"\",$U53=\"\"),\"\",IF($N53=\"\",IF(Z53=0,\"-\",Z53),IF(T53=0,\"0\",$H53*IF($L53=\"\",1,$L53)*T53))),\"-\")","v":"-"}]
[null,"III.4.1",1,"All wastewater",null,"N2O from treatment",null,null,null,null,null,null,"N2O",null,{"$f":"IFERROR(CONCATENATE(\"tCO2e/\",VLOOKUP($N54,'Emission factors'!$C:$I,6,FALSE)),\"\")","v":""},{"$f":"IFERROR(VLOOKUP($N54,'Emission factors'!$C:$BQ,9,FALSE),\"\")","v":""},{"$f":"IFERROR(VLOOKUP($N54,'Emission factors'!$C:$BQ,12,FALSE),\"\")","v":""},{"$f":"IFERROR(VLOOKUP($N54,'Emission factors'!$C:$BQ,15,FALSE),\"\")","v":""},{"$f":"IFERROR(VLOOKUP($N54,'Emission factors'!$C:$BQ,65,FALSE),\"\")","v":""},{"$f":"IFERROR(VLOOKUP($N54,'Emission factors'!$C:$BQ,67,FALSE),\"\")","v":""},"✓",null,null,{"$f":"[5]Emissions!$B$22*310/1000","v":3480.0066332933643},null,null,"-","-",3480.0066332933643,{"$f":"IFERROR(IF(AND($N54=\"\",$U54=\"\"),\"\",IF($N54=\"\",IF(Y54=\"\",SUM(AA54:AC54),IF(Y54=0,\"0\",Y54)),IF($S54=\"\",SUM($AA54:$AC54),IF($S54=0,\"0\",$H54*IF($L54=\"\",1,$L54)*$S54)))),\"-\")","v":3480.0066332933643},{"$f":"IFERROR(IF(AND($N54=\"\",$U54=\"\"),\"\",IF($N54=\"\",IF(Z54=0,\"-\",Z54),IF(T54=0,\"0\",$H54*IF($L54=\"\",1,$L54)*T54))),\"-\")","v":"-"}]
[null,"III.4.1",1,"All wastewater",null,"N2O from discharge",null,null,null,null,null,null,"N2O",null,null,{"$f":"IFERROR(VLOOKUP($N55,'Emission factors'!$C:$BQ,9,FALSE),\"\")","v":""},{"$f":"IFERROR(VLOOKUP($N55,'Emission factors'!$C:$BQ,12,FALSE),\"\")","v":""},{"$f":"IFERROR(VLOOKUP($N55,'Emission factors'!$C:$BQ,15,FALSE),\"\")","v":""},{"$f":"IFERROR(VLOOKUP($N55,'Emission factors'!$C:$BQ,65,FALSE),\"\")","v":""},{"$f":"IFERROR(VLOOKUP($N55,'Emission factors'!$C:$BQ,67,FALSE),\"\")","v":""},"✓",null,null,{"$f":"[5]Emissions!$B$23*310/1000","v":29392.184924826277},null,null,null,{"$f":"IFERROR(IF(AND($N55=\"\",$U55=\"\"),\"\",IF($N55=\"\",IF(W55=0,\"-\",W55),IF(Q55=0,\"0\",$H55*IF($L55=\"\",1,$L55)*Q55))),\"-\")","v":"-"},{"$f":"IFERROR(IF(AND($N55=\"\",$U55=\"\"),\"\",IF($N55=\"\",IF(X55=0,\"-\",X55),IF(R55=0,\"0\",$H55*IF($L55=\"\",1,$L55)*R55))),\"-\")","v":29392.184924826277},{"$f":"IFERROR(IF(AND($N55=\"\",$U55=\"\"),\"\",IF($N55=\"\",IF(Y55=\"\",SUM(AA55:AC55),IF(Y55=0,\"0\",Y55)),IF($S55=\"\",SUM($AA55:$AC55),IF($S55=0,\"0\",$H55*IF($L55=\"\",1,$L55)*$S55)))),\"-\")","v":29392.184924826277},{"$f":"IFERROR(IF(AND($N55=\"\",$U55=\"\"),\"\",IF($N55=\"\",IF(Z55=0,\"-\",Z55),IF(T55=0,\"0\",$H55*IF($L55=\"\",1,$L55)*T55))),\"-\")","v":"-"}]
[null,"III.4.2",3,"Emissions from wastewater generated within but treated outside of the city ",null,null,"NO"]
[null,"III.4.2",3,null,null,null,null,null,null,null,null,null,null,null,{"$f":"IFERROR(CONCATENATE(\"tCO2e/\",VLOOKUP($N57,'Emission factors'!$C:$I,6,FALSE)),\"\")","v":""},{"$f":"IFERROR(VLOOKUP($N57,'Emission factors'!$C:$BQ,9,FALSE),\"\")","v":""},{"$f":"IFERROR(VLOOKUP($N57,'Emission factors'!$C:$BQ,12,FALSE),\"\")","v":""},{"$f":"IFERROR(VLOOKUP($N57,'Emission factors'!$C:$BQ,15,FALSE),\"\")","v":""},{"$f":"IFERROR(VLOOKUP($N57,'Emission factors'!$C:$BQ,65,FALSE),\"\")","v":""},{"$f":"IFERROR(VLOOKUP($N57,'Emission factors'!$C:$BQ,67,FALSE),\"\")","v":""},null,null,null,null,null,null,{"$f":"IFERROR(IF(AND($N57=\"\",$U57=\"\"),\"\",IF($N57=\"\",IF(V57=0,\"-\",V57),IF(P57=0,\"0\",$H57*IF($L57=\"\",1,$L57)*P57))),\"-\")","v":""},"","",{"$f":"IFERROR(IF(AND($N57=\"\",$U57=\"\"),\"\",IF($N57=\"\",IF(Y57=\"\",SUM(AA57:AC57),IF(Y57=0,\"0\",Y57)),IF($S57=\"\",SUM($AA57:$AC57),IF($S57=0,\"0\",$H57*IF($L57=\"\",1,$L57)*$S57)))),\"-\")","v":""},{"$f":"IFERROR(IF(AND($N57=\"\",$U57=\"\"),\"\",IF($N57=\"\",IF(Z57=0,\"-\",Z57),IF(T57=0,\"0\",$H57*IF($L57=\"\",1,$L57)*T57))),\"-\")","v":""}]
[null,"III.4.2",3,null,null,null,null,null,null,null,null,null,null,null,{"$f":"IFERROR(CONCATENATE(\"tCO2e/\",VLOOKUP($N58,'Emission factors'!$C:$I,6,FALSE)),\"\")","v":""},{"$f":"IFERROR(VLOOKUP($N58,'Emission factors'!$C:$BQ,9,FALSE),\"\")","v":""},{"$f":"IFERROR(VLOOKUP($N58,'Emission factors'!$C:$BQ,12,FALSE),\"\")","v":""},{"$f":"IFERROR(VLOOKUP($N58,'Emission factors'!$C:$BQ,15,FALSE),\"\")","v":""},{"$f":"IFERROR(VLOOKUP($N58,'Emission factors'!$C:$BQ,65,FALSE),\"\")","v":""},{"$f":"IFERROR(VLOOKUP($N58,'Emission factors'!$C:$BQ,67,FALSE),\"\")","v":""},null,null,null,null,null,null,"","","",{"$f":"IFERROR(IF(AND($N58=\"\",$U58=\"\"),\"\",IF($N58=\"\",IF(Y58=\"\",SUM(AA58:AC58),IF(Y58=0,\"0\",Y58)),IF($S58=\"\",SUM($AA58:$AC58),IF($S58=0,\"0\",$H58*IF($L58=\"\",1,$L58)*$S58)))),\"-\")","v":""},{"$f":"IFERROR(IF(AND($N58=\"\",$U58=\"\"),\"\",IF($N58=\"\",IF(Z58=0,\"-\",Z58),IF(T58=0,\"0\",$H58*IF($L58=\"\",1,$L58)*T58))),\"-\")","v":""}]
[null,"III.4.3",1,"Emissions from wastewater generated outside the city boundary but treated within the city",null,null,"NO"]
[null,"III.4.3",1,null,null,null,null,null,null,null,null,null,null,null,{"$f":"IFERROR(CONCATENATE(\"tCO2e/\",VLOOKUP($N60,'Emission factors'!$C:$I,6,FALSE)),\"\")","v":""},{"$f":"IFERROR(VLOOKUP($N60,'Emission factors'!$C:$BQ,9,FALSE),\"\")","v":""},{"$f":"IFERROR(VLOOKUP($N60,'Emission factors'!$C:$BQ,12,FALSE),\"\")","v":""},{"$f":"IFERROR(VLOOKUP($N60,'Emission factors'!$C:$BQ,15,FALSE),\"\")","v":""},{"$f":"IFERROR(VLOOKUP($N60,'Emission factors'!$C:$BQ,65,FALSE),\"\")","v":""},{"$f":"IFERROR(VLOOKUP($N60,'Emission factors'!$C:$BQ,67,FALSE),\"\")","v":""},null,null,null,null,null,null,{"$f":"IFERROR(IF(AND($N60=\"\",$U60=\"\"),\"\",IF($N60=\"\",IF(V60=0,\"-\",V60),IF(P60=0,\"0\",$H60*IF($L60=\"\",1,$L60)*P60))),\"-\")","v":""},"","",{"$f":"IFERROR(IF(AND($N60=\"\",$U60=\"\"),\"\",IF($N60=\"\",IF(Y60=\"\",SUM(AA60:AC60),IF(Y60=0,\"0\",Y60)),IF($S60=\"\",SUM($AA60:$AC60),IF($S60=0,\"0\",$H60*IF($L60=\"\",1,$L60)*$S60)))),\"-\")","v":""},{"$f":"IFERROR(IF(AND($N60=\"\",$U60=\"\"),\"\",IF($N60=\"\",IF(Z60=0,\"-\",Z60),IF(T60=0,\"0\",$H60*IF($L60=\"\",1,$L60)*T60))),\"-\")","v":""}]
[null,"III.4.3",1,null,null,null,null,null,null,null,null,null,null,null,{"$f":"IFERROR(CONCATENATE(\"tCO2e/\",VLOOKUP($N61,'Emission factors'!$C:$I,6,FALSE)),\"\")","v":""},{"$f":"IFERROR(VLOOKUP($N61,'Emission factors'!$C:$BQ,9,FALSE),\"\")","v":""},{"$f":"IFERROR(VLOOKUP($N61,'Emission factors'!$C:$BQ,12,FALSE),\"\")","v":""},{"$f":"IFERROR(VLOOKUP($N61,'Emission factors'!$C:$BQ,15,FALSE),\"\")","v":""},{"$f":"IFERROR(VLOOKUP($N61,'Emission factors'!$C:$BQ,65,FALSE),\"\")","v":""},{"$f":"IFERROR(VLOOKUP($N61,'Emission factors'!$C:$BQ,67,FALSE),\"\")","v":""},null,null,null,null,null,null,"","","",{"$f":"IFERROR(IF(AND($N61=\"\",$U61=\"\"),\"\",IF($N61=\"\",IF(Y61=\"\",SUM(AA61:AC61),IF(Y61=0,\"0\",Y61)),IF($S61=\"\",SUM($AA61:$AC61),IF($S61=0,\"0\",$H61*IF($L61=\"\",1,$L61)*$S61)))),\"-\")","v":""},{"$f":"IFERROR(IF(AND($N61=\"\",$U61=\"\"),\"\",IF($N61=\"\",IF(Z61=0,\"-\",Z61),IF(T61=0,\"0\",$H61*IF($L61=\"\",1,$L61)*T61))),\"-\")","v":""}]
[]
[null,"III. MACRO"]

{"sheet":"IV - IPPU","index":8,"n_rows":23,"n_cols":60,"rows_kept":23,"cut":false,"hidden":false,"merged":[[3,12,4,12],[7,13,7,34],[15,13,15,34],[1,57,1,58],[3,57,4,58],[3,35,4,35],[7,35,8,35],[7,36,7,44],[7,57,8,57],[7,58,8,58],[15,57,16,57],[15,58,16,58],[7,12,8,12],[15,12,16,12],[15,45,15,53],[15,54,15,55],[7,11,8,11],[15,11,16,11],[1,6,1,7],[3,6,4,7],[7,8,7,10],[15,8,15,10],[7,1,8,1],[7,2,8,2],[7,3,7,4],[7,5,8,5],[7,6,7,7],[15,1,16,1],[15,2,16,2],[15,3,15,4],[15,5,16,5],[15,6,15,7],[15,56,16,56],[7,54,7,55],[7,56,8,56],[7,45,7,53],[15,35,16,35],[15,36,15,44]]}
[]
[null,"IV INDUSTRIAL PROCESSES AND PRODUCT USE (IPPU)",null,null,null,null,"",null,null,null,null,null,"",null,null,null,null,null,null,null,null,null,null,null,null,null,null,null,null,null,null,null,null,null,null,"",null,null,null,null,null,null,null,null,null,null,null,null,null,null,null,null,null,null,null,null,null,""]
[]
[null,"Use this tab to record activity and emissions data for IPPU sources. This is required for BASIC+ only. Emission factors should be recorded in the 'Emission factors' tab.",null,null,null,null,"Convert activity data units",null,null,null,null,null,"View emission factor(s)",null,null,null,null,null,null,null,null,null,null,null,null,null,null,null,null,null,null,null,null,null,null,"Enter emissions data",null,null,null,null,null,null,null,null,null,null,null,null,null,null,null,null,null,null,null,null,null,"Data quality explanation (optional)"]
[]
[null,"IV.1 INDUSTRIAL PROCESSES"]
[]
[null,"GPC ref No.","Scope","GHG Emissions Source",null,"Notation \nkeys","Activity data",null,"Activity data multiplier",null,null,"Gas(es)","Emission factor","Emission factor",null,null,null,null,null,null,null,null,null,null,null,null,null,null,null,null,null,null,null,null,null,"Emissions data","GHGs (metric tonnes CO2e)",null,null,null,null,null,null,null,null,"GHGs (metric tonnes CO2e)",null,null,null,null,null,null,null,null,"Data Quality",null,"Description of method(s) used or explanation for using notation key(s)","Source","Data quality explanation (optional)"]
[null,null,null,"Activity","Description",null,"Amount","Units","From","To","Factor",null,null,"Units","CO2","CH4","N2O","CF4","C2F6","HFC-23","HFC-32","HFC-41","HFC-125","HFC-134","HFC-134a","HFC-143","HFC-143a","HFC-152a","HFC-227ea","HFC-236fa","HFC-245ca","SF6","NF3","Total tCO2e","CO2(b)",null,"CO2","CH4","N2O","PFC","HFC","SF6","NF3","Total tCO2e","CO2(b)","CO2","CH4","N2O","PFC","HFC","SF6","NF3","Total tCO2e","CO2(b)","AD","EF"]
[null,"IV.1",1,"Emissions from industrial processes occurring in the city boundary",null,null,null,null,null,null,null,null,null,null,null,null,null,null,null,null,null,null,null,null,null,null,null,null,null,null,null,null,null,null,null,null,null,null,null,null,null,null,null,null,null,null,null,null,null,null,null,null,null,null,null,null,"IV.1 has not been estimated; activity not required for BASIC"]
[null,"IV.1",1,"All industrial processes",null,null,null,null,null,null,null,"CO2, CH4, N2O",null,{"$f":"IFERROR(CONCATENATE(\"tCO2e/\",VLOOKUP($M11,'Emission factors'!$C:$H,6,FALSE)),\"\")","v":""},{"$f":"IFERROR(VLOOKUP($M11,'Emission factors'!$C:$BQ,9,FALSE),\"\")","v":""},{"$f":"IFERROR(VLOOKUP($M11,'Emission factors'!$C:$BQ,12,FALSE),\"\")","v":""},{"$f":"IFERROR(VLOOKUP($M11,'Emission factors'!$C:$BQ,15,FALSE),\"\")","v":""},{"$f":"IFERROR(VLOOKUP($M11,'Emission factors'!$C:$BQ,18,FALSE),\"\")","v":""},{"$f":"IFERROR(VLOOKUP($M11,'Emission factors'!$C:$BQ,21,FALSE),\"\")","v":""},{"$f":"IFERROR(VLOOKUP($M11,'Emission factors'!$C:$BQ,24,FALSE),\"\")","v":""},{"$f":"IFERROR(VLOOKUP($M11,'Emission factors'!$C:$BQ,27,FALSE),\"\")","v":""},{"$f":"IFERROR(VLOOKUP($M11,'Emission factors'!$C:$BQ,30,FALSE),\"\")","v":""},{"$f":"IFERROR(VLOOKUP($M11,'Emission factors'!$C:$BQ,33,FALSE),\"\")","v":""},{"$f":"IFERROR(VLOOKUP($M11,'Emission factors'!$C:$BQ,36,FALSE),\"\")","v":""},{"$f":"IFERROR(VLOOKUP($M11,'Emission factors'!$C:$BQ,39,FALSE),\"\")","v":""},{"$f":"IFERROR(VLOOKUP($M11,'Emission factors'!$C:$BQ,42,FALSE),\"\")","v":""},{"$f":"IFERROR(VLOOKUP($M11,'Emission factors'!$C:$BQ,45,FALSE),\"\")","v":""},{"$f":"IFERROR(VLOOKUP($M11,'Emission factors'!$C:$BQ,48,FALSE),\"\")","v":""},{"$f":"IFERROR(VLOOKUP($M11,'Emission factors'!$C:$BQ,51,FALSE),\"\")","v":""},{"$f":"IFERROR(VLOOKUP($M11,'Emission factors'!$C:$BQ,54,FALSE),\"\")","v":""},{"$f":"IFERROR(VLOOKUP($M11,'Emission factors'!$C:$BQ,57,FALSE),\"\")","v":""},{"$f":"IFERROR(VLOOKUP($M11,'Emission factors'!$C:$BQ,60,FALSE),\"\")","v":""},{"$f":"IFERROR(VLOOKUP($M11,'Emission factors'!$C:$BQ,63,FALSE),\"\")","v":""},{"$f":"IFERROR(VLOOKUP($M11,'Emission factors'!$C:$BQ,65,FALSE),\"\")","v":""},{"$f":"IFERROR(VLOOKUP($M11,'Emission factors'!$C:$BQ,67,FALSE),\"\")","v":""},"✓",null,null,null,null,null,null,null,{"$f":"'[8]Background Calcs - Stationary'!$B$10","v":53738},null,{"$f":"IFERROR(IF(AND($M11=\"\",$AJ11=\"\"),\"\",IF($M11=\"\",IF(AK11=0,\"-\",AK11),IF(O11=0,\"0\",$G11*IF($K11=\"\",1,$K11)*O11))),\"-\")","v":"-"},"-","-",{"$f":"IFERROR(IF(AND($M11=\"\",$AJ11=\"\"),\"\",IF($M11=\"\",IF(AN11=0,\"-\",AN11),IF(AND(R11=0,S11=0),\"0\",$G11*IF($K11=\"\",1,$K11)*(R11+S11)))),\"-\")","v":"-"},{"$f":"IFERROR(IF(AND($M11=\"\",$AJ11=\"\"),\"\",IF($M11=\"\",IF(AO11=0,\"-\",AO11),IF(AND(T11=0,U11=0,V11=0,W11=0,X11=0,Y11=0,Z11=0,AA11=0,AB11=0,AC11=0,AD11=0,AE11=0),\"0\",$G11*IF($K11=\"\",1,$K11)*(T11+U11+V11+W11+X11+Y11+Z11+AA11+AB11+AC11+AD11+AE11)))),\"-\")","v":"-"},{"$f":"IFERROR(IF(AND($M11=\"\",$AJ11=\"\"),\"\",IF($M11=\"\",IF(AP11=0,\"-\",AP11),IF(AF11=0,\"0\",$G11*IF($K11=\"\",1,$K11)*AF11))),\"-\")","v":"-"},{"$f":"IFERROR(IF(AND($M11=\"\",$AJ11=\"\"),\"\",IF($M11=\"\",IF(AQ11=0,\"-\",AQ11),IF(AG11=0,\"0\",$G11*IF($K11=\"\",1,$K11)*AG11))),\"-\")","v":"-"},{"$f":"IFERROR(IF(AND($M11=\"\",$AJ11=\"\"),\"\",IF($M11=\"\",IF(AR11=\"\",SUM(AT11:AZ11),IF(AR11=0,\"0\",AR11)),IF($AH11=\"\",SUM($AT11:$AZ11),IF($AH11=0,\"0\",$G11*IF($K11=\"\",1,$K11)*$AH11)))),\"-\")","v":53738},{"$f":"IFERROR(IF(AND($M11=\"\",$AJ11=\"\"),\"\",IF($M11=\"\",IF(AS11=0,\"-\",AS11),IF(AI11=0,\"0\",$G11*IF($K11=\"\",1,$K11)*AI11))),\"-\")","v":"-"}]
[null,"IV.1",1,null,null,null,null,null,null,null,null,null,null,{"$f":"IFERROR(CONCATENATE(\"tCO2e/\",VLOOKUP($M12,'Emission factors'!$C:$H,6,FALSE)),\"\")","v":""},{"$f":"IFERROR(VLOOKUP($M12,'Emission factors'!$C:$BQ,9,FALSE),\"\")","v":""},{"$f":"IFERROR(VLOOKUP($M12,'Emission factors'!$C:$BQ,12,FALSE),\"\")","v":""},{"$f":"IFERROR(VLOOKUP($M12,'Emission factors'!$C:$BQ,15,FALSE),\"\")","v":""},{"$f":"IFERROR(VLOOKUP($M12,'Emission factors'!$C:$BQ,18,FALSE),\"\")","v":""},{"$f":"IFERROR(VLOOKUP($M12,'Emission factors'!$C:$BQ,21,FALSE),\"\")","v":""},{"$f":"IFERROR(VLOOKUP($M12,'Emission factors'!$C:$BQ,24,FALSE),\"\")","v":""},{"$f":"IFERROR(VLOOKUP($M12,'Emission factors'!$C:$BQ,27,FALSE),\"\")","v":""},{"$f":"IFERROR(VLOOKUP($M12,'Emission factors'!$C:$BQ,30,FALSE),\"\")","v":""},{"$f":"IFERROR(VLOOKUP($M12,'Emission factors'!$C:$BQ,33,FALSE),\"\")","v":""},{"$f":"IFERROR(VLOOKUP($M12,'Emission factors'!$C:$BQ,36,FALSE),\"\")","v":""},{"$f":"IFERROR(VLOOKUP($M12,'Emission factors'!$C:$BQ,39,FALSE),\"\")","v":""},{"$f":"IFERROR(VLOOKUP($M12,'Emission factors'!$C:$BQ,42,FALSE),\"\")","v":""},{"$f":"IFERROR(VLOOKUP($M12,'Emission factors'!$C:$BQ,45,FALSE),\"\")","v":""},{"$f":"IFERROR(VLOOKUP($M12,'Emission factors'!$C:$BQ,48,FALSE),\"\")","v":""},{"$f":"IFERROR(VLOOKUP($M12,'Emission factors'!$C:$BQ,51,FALSE),\"\")","v":""},{"$f":"IFERROR(VLOOKUP($M12,'Emission factors'!$C:$BQ,54,FALSE),\"\")","v":""},{"$f":"IFERROR(VLOOKUP($M12,'Emission factors'!$C:$BQ,57,FALSE),\"\")","v":""},{"$f":"IFERROR(VLOOKUP($M12,'Emission factors'!$C:$BQ,60,FALSE),\"\")","v":""},{"$f":"IFERROR(VLOOKUP($M12,'Emission factors'!$C:$BQ,63,FALSE),\"\")","v":""},{"$f":"IFERROR(VLOOKUP($M12,'Emission factors'!$C:$BQ,65,FALSE),\"\")","v":""},{"$f":"IFERROR(VLOOKUP($M12,'Emission factors'!$C:$BQ,67,FALSE),\"\")","v":""},null,null,null,null,null,null,null,null,null,null,"","","",{"$f":"IFERROR(IF(AND($M12=\"\",$AJ12=\"\"),\"\",IF($M12=\"\",IF(AN12=0,\"-\",AN12),IF(AND(R12=0,S12=0),\"0\",$G12*IF($K12=\"\",1,$K12)*(R12+S12)))),\"-\")","v":""},{"$f":"IFERROR(IF(AND($M12=\"\",$AJ12=\"\"),\"\",IF($M12=\"\",IF(AO12=0,\"-\",AO12),IF(AND(T12=0,U12=0,V12=0,W12=0,X12=0,Y12=0,Z12=0,AA12=0,AB12=0,AC12=0,AD12=0,AE12=0),\"0\",$G12*IF($K12=\"\",1,$K12)*(T12+U12+V12+W12+X12+Y12+Z12+AA12+AB12+AC12+AD12+AE12)))),\"-\")","v":""},{"$f":"IFERROR(IF(AND($M12=\"\",$AJ12=\"\"),\"\",IF($M12=\"\",IF(AP12=0,\"-\",AP12),IF(AF12=0,\"0\",$G12*IF($K12=\"\",1,$K12)*AF12))),\"-\")","v":""},{"$f":"IFERROR(IF(AND($M12=\"\",$AJ12=\"\"),\"\",IF($M12=\"\",IF(AQ12=0,\"-\",AQ12),IF(AG12=0,\"0\",$G12*IF($K12=\"\",1,$K12)*AG12))),\"-\")","v":""},{"$f":"IFERROR(IF(AND($M12=\"\",$AJ12=\"\"),\"\",IF($M12=\"\",IF(AR12=\"\",SUM(AT12:AZ12),IF(AR12=0,\"0\",AR12)),IF($AH12=\"\",SUM($AT12:$AZ12),IF($AH12=0,\"0\",$G12*IF($K12=\"\",1,$K12)*$AH12)))),\"-\")","v":""},{"$f":"IFERROR(IF(AND($M12=\"\",$AJ12=\"\"),\"\",IF($M12=\"\",IF(AS12=0,\"-\",AS12),IF(AI12=0,\"0\",$G12*IF($K12=\"\",1,$K12)*AI12))),\"-\")","v":""}]
[]
[null,"IV.2 PRODUCT USE"]
[]
[null,"GPC ref No.","Scope","GHG Emissions Source",null,"Notation \nkeys","Activity data",null,"Activity data multiplier",null,null,"Gas(es)","Emission factor","Emission factor",null,null,null,null,null,null,null,null,null,null,null,null,null,null,null,null,null,null,null,null,null,"Emissions data","GHGs (metric tonnes CO2e)",null,null,null,null,null,null,null,null,"GHGs (metric tonnes CO2e)",null,null,null,null,null,null,null,null,"Data Quality",null,"Description of method(s) used or explanation for using notation key(s)","Source","Data quality explanation (optional)"]
[null,null,null,"Activity","Description",null,"Amount","Units","From","To","Factor",null,null,"Units","CO2","CH4","N2O","CF4","C2F6","HFC-23","HFC-32","HFC-41","HFC-125","HFC-134","HFC-134a","HFC-143","HFC-143a","HFC-152a","HFC-227ea","HFC-236fa","HFC-245ca","SF6","NF3","Total tCO2e","CO2(b)",null,"CO2","CH4","N2O","PFC","HFC","SF6","NF3","Total tCO2e","CO2(b)","CO2","CH4","N2O","PFC","HFC","SF6","NF3","Total tCO2e","CO2(b)","AD","EF"]
[null,"IV.2",1,"Emissions from product use occurring within the city boundary",null,null,null,null,null,null,null,null,null,null,null,null,null,null,null,null,null,null,null,null,null,null,null,null,null,null,null,null,null,null,null,null,null,null,null,null,null,null,null,null,null,null,null,null,null,null,null,null,null,null,null,null,"IV.2 has not been estimated; activity not required for BASIC"]
[null,"IV.2",1,"  SF6 and PFCs from other product uses","SF6 from electricity distribution",null,null,null,null,null,null,null,null,{"$f":"IFERROR(CONCATENATE(\"tCO2e/\",VLOOKUP($M19,'Emission factors'!$C:$H,6,FALSE)),\"\")","v":""},{"$f":"IFERROR(VLOOKUP($M19,'Emission factors'!$C:$BQ,9,FALSE),\"\")","v":""},{"$f":"IFERROR(VLOOKUP($M19,'Emission factors'!$C:$BQ,12,FALSE),\"\")","v":""},{"$f":"IFERROR(VLOOKUP($M19,'Emission factors'!$C:$BQ,15,FALSE),\"\")","v":""},{"$f":"IFERROR(VLOOKUP($M19,'Emission factors'!$C:$BQ,18,FALSE),\"\")","v":""},{"$f":"IFERROR(VLOOKUP($M19,'Emission factors'!$C:$BQ,21,FALSE),\"\")","v":""},{"$f":"IFERROR(VLOOKUP($M19,'Emission factors'!$C:$BQ,24,FALSE),\"\")","v":""},{"$f":"IFERROR(VLOOKUP($M19,'Emission factors'!$C:$BQ,27,FALSE),\"\")","v":""},{"$f":"IFERROR(VLOOKUP($M19,'Emission factors'!$C:$BQ,30,FALSE),\"\")","v":""},{"$f":"IFERROR(VLOOKUP($M19,'Emission factors'!$C:$BQ,33,FALSE),\"\")","v":""},{"$f":"IFERROR(VLOOKUP($M19,'Emission factors'!$C:$BQ,36,FALSE),\"\")","v":""},{"$f":"IFERROR(VLOOKUP($M19,'Emission factors'!$C:$BQ,39,FALSE),\"\")","v":""},{"$f":"IFERROR(VLOOKUP($M19,'Emission factors'!$C:$BQ,42,FALSE),\"\")","v":""},{"$f":"IFERROR(VLOOKUP($M19,'Emission factors'!$C:$BQ,45,FALSE),\"\")","v":""},{"$f":"IFERROR(VLOOKUP($M19,'Emission factors'!$C:$BQ,48,FALSE),\"\")","v":""},{"$f":"IFERROR(VLOOKUP($M19,'Emission factors'!$C:$BQ,51,FALSE),\"\")","v":""},{"$f":"IFERROR(VLOOKUP($M19,'Emission factors'!$C:$BQ,54,FALSE),\"\")","v":""},{"$f":"IFERROR(VLOOKUP($M19,'Emission factors'!$C:$BQ,57,FALSE),\"\")","v":""},{"$f":"IFERROR(VLOOKUP($M19,'Emission factors'!$C:$BQ,60,FALSE),\"\")","v":""},{"$f":"IFERROR(VLOOKUP($M19,'Emission factors'!$C:$BQ,63,FALSE),\"\")","v":""},{"$f":"IFERROR(VLOOKUP($M19,'Emission factors'!$C:$BQ,65,FALSE),\"\")","v":""},{"$f":"IFERROR(VLOOKUP($M19,'Emission factors'!$C:$BQ,67,FALSE),\"\")","v":""},"✓",null,null,null,null,null,null,null,2365.2516191262748,null,{"$f":"IFERROR(IF(AND($M19=\"\",$AJ19=\"\"),\"\",IF($M19=\"\",IF(AK19=0,\"-\",AK19),IF(O19=0,\"0\",$G19*IF($K19=\"\",1,$K19)*O19))),\"-\")","v":"-"},"-","-",{"$f":"IFERROR(IF(AND($M19=\"\",$AJ19=\"\"),\"\",IF($M19=\"\",IF(AN19=0,\"-\",AN19),IF(AND(R19=0,S19=0),\"0\",$G19*IF($K19=\"\",1,$K19)*(R19+S19)))),\"-\")","v":"-"},{"$f":"IFERROR(IF(AND($M19=\"\",$AJ19=\"\"),\"\",IF($M19=\"\",IF(AO19=0,\"-\",AO19),IF(AND(T19=0,U19=0,V19=0,W19=0,X19=0,Y19=0,Z19=0,AA19=0,AB19=0,AC19=0,AD19=0,AE19=0),\"0\",$G19*IF($K19=\"\",1,$K19)*(T19+U19+V19+W19+X19+Y19+Z19+AA19+AB19+AC19+AD19+AE19)))),\"-\")","v":"-"},{"$f":"IFERROR(IF(AND($M19=\"\",$AJ19=\"\"),\"\",IF($M19=\"\",IF(AP19=0,\"-\",AP19),IF(AF19=0,\"0\",$G19*IF($K19=\"\",1,$K19)*AF19))),\"-\")","v":"-"},"-",{"$f":"IFERROR(IF(AND($M19=\"\",$AJ19=\"\"),\"\",IF($M19=\"\",IF(AR19=\"\",SUM(AT19:AZ19),IF(AR19=0,\"0\",AR19)),IF($AH19=\"\",SUM($AT19:$AZ19),IF($AH19=0,\"0\",$G19*IF($K19=\"\",1,$K19)*$AH19)))),\"-\")","v":2365.2516191262748},{"$f":"IFERROR(IF(AND($M19=\"\",$AJ19=\"\"),\"\",IF($M19=\"\",IF(AS19=0,\"-\",AS19),IF(AI19=0,\"0\",$G19*IF($K19=\"\",1,$K19)*AI19))),\"-\")","v":"-"},null,null,null,null,null,"what is source of SF6 calculation?"]
[null,"IV.2",1,"    Refrigeration and stationary air conditioning","Refrigerants",null,null,null,null,null,null,null,null,{"$f":"IFERROR(CONCATENATE(\"tCO2e/\",VLOOKUP($M20,'Emission factors'!$C:$H,6,FALSE)),\"\")","v":""},{"$f":"IFERROR(VLOOKUP($M20,'Emission factors'!$C:$BQ,9,FALSE),\"\")","v":""},{"$f":"IFERROR(VLOOKUP($M20,'Emission factors'!$C:$BQ,12,FALSE),\"\")","v":""},{"$f":"IFERROR(VLOOKUP($M20,'Emission factors'!$C:$BQ,15,FALSE),\"\")","v":""},{"$f":"IFERROR(VLOOKUP($M20,'Emission factors'!$C:$BQ,18,FALSE),\"\")","v":""},{"$f":"IFERROR(VLOOKUP($M20,'Emission factors'!$C:$BQ,21,FALSE),\"\")","v":""},{"$f":"IFERROR(VLOOKUP($M20,'Emission factors'!$C:$BQ,24,FALSE),\"\")","v":""},{"$f":"IFERROR(VLOOKUP($M20,'Emission factors'!$C:$BQ,27,FALSE),\"\")","v":""},{"$f":"IFERROR(VLOOKUP($M20,'Emission factors'!$C:$BQ,30,FALSE),\"\")","v":""},{"$f":"IFERROR(VLOOKUP($M20,'Emission factors'!$C:$BQ,33,FALSE),\"\")","v":""},{"$f":"IFERROR(VLOOKUP($M20,'Emission factors'!$C:$BQ,36,FALSE),\"\")","v":""},{"$f":"IFERROR(VLOOKUP($M20,'Emission factors'!$C:$BQ,39,FALSE),\"\")","v":""},{"$f":"IFERROR(VLOOKUP($M20,'Emission factors'!$C:$BQ,42,FALSE),\"\")","v":""},{"$f":"IFERROR(VLOOKUP($M20,'Emission factors'!$C:$BQ,45,FALSE),\"\")","v":""},{"$f":"IFERROR(VLOOKUP($M20,'Emission factors'!$C:$BQ,48,FALSE),\"\")","v":""},{"$f":"IFERROR(VLOOKUP($M20,'Emission factors'!$C:$BQ,51,FALSE),\"\")","v":""},{"$f":"IFERROR(VLOOKUP($M20,'Emission factors'!$C:$BQ,54,FALSE),\"\")","v":""},{"$f":"IFERROR(VLOOKUP($M20,'Emission factors'!$C:$BQ,57,FALSE),\"\")","v":""},{"$f":"IFERROR(VLOOKUP($M20,'Emission factors'!$C:$BQ,60,FALSE),\"\")","v":""},{"$f":"IFERROR(VLOOKUP($M20,'Emission factors'!$C:$BQ,63,FALSE),\"\")","v":""},{"$f":"IFERROR(VLOOKUP($M20,'Emission factors'!$C:$BQ,65,FALSE),\"\")","v":""},{"$f":"IFERROR(VLOOKUP($M20,'Emission factors'!$C:$BQ,67,FALSE),\"\")","v":""},"✓",null,null,null,null,null,null,null,{"$f":"'[8]Internal ICF Summary'!$C$4","v":150797.45316807186},null,{"$f":"IFERROR(IF(AND($M20=\"\",$AJ20=\"\"),\"\",IF($M20=\"\",IF(AK20=0,\"-\",AK20),IF(O20=0,\"0\",$G20*IF($K20=\"\",1,$K20)*O20))),\"-\")","v":"-"},{"$f":"IFERROR(IF(AND($M20=\"\",$AJ20=\"\"),\"\",IF($M20=\"\",IF(AL20=0,\"-\",AL20),IF(P20=0,\"0\",$G20*IF($K20=\"\",1,$K20)*P20))),\"-\")","v":"-"},{"$f":"IFERROR(IF(AND($M20=\"\",$AJ20=\"\"),\"\",IF($M20=\"\",IF(AM20=0,\"-\",AM20),IF(Q20=0,\"0\",$G20*IF($K20=\"\",1,$K20)*Q20))),\"-\")","v":"-"},{"$f":"IFERROR(IF(AND($M20=\"\",$AJ20=\"\"),\"\",IF($M20=\"\",IF(AN20=0,\"-\",AN20),IF(AND(R20=0,S20=0),\"0\",$G20*IF($K20=\"\",1,$K20)*(R20+S20)))),\"-\")","v":"-"},{"$f":"IFERROR(IF(AND($M20=\"\",$AJ20=\"\"),\"\",IF($M20=\"\",IF(AO20=0,\"-\",AO20),IF(AND(T20=0,U20=0,V20=0,W20=0,X20=0,Y20=0,Z20=0,AA20=0,AB20=0,AC20=0,AD20=0,AE20=0),\"0\",$G20*IF($K20=\"\",1,$K20)*(T20+U20+V20+W20+X20+Y20+Z20+AA20+AB20+AC20+AD20+AE20)))),\"-\")","v":"-"},"-","-",{"$f":"IFERROR(IF(AND($M20=\"\",$AJ20=\"\"),\"\",IF($M20=\"\",IF(AR20=\"\",SUM(AT20:AZ20),IF(AR20=0,\"0\",AR20)),IF($AH20=\"\",SUM($AT20:$AZ20),IF($AH20=0,\"0\",$G20*IF($K20=\"\",1,$K20)*$AH20)))),\"-\")","v":150797.45316807186},{"$f":"IFERROR(IF(AND($M20=\"\",$AJ20=\"\"),\"\",IF($M20=\"\",IF(AS20=0,\"-\",AS20),IF(AI20=0,\"0\",$G20*IF($K20=\"\",1,$K20)*AI20))),\"-\")","v":"-"}]
[null,"IV.2",1,"  N2O from product uses","N2O",null,null,null,null,null,null,null,null,{"$f":"IFERROR(CONCATENATE(\"tCO2e/\",VLOOKUP($M21,'Emission factors'!$C:$H,6,FALSE)),\"\")","v":""},{"$f":"IFERROR(VLOOKUP($M21,'Emission factors'!$C:$BQ,9,FALSE),\"\")","v":""},{"$f":"IFERROR(VLOOKUP($M21,'Emission factors'!$C:$BQ,12,FALSE),\"\")","v":""},{"$f":"IFERROR(VLOOKUP($M21,'Emission factors'!$C:$BQ,15,FALSE),\"\")","v":""},{"$f":"IFERROR(VLOOKUP($M21,'Emission factors'!$C:$BQ,18,FALSE),\"\")","v":""},{"$f":"IFERROR(VLOOKUP($M21,'Emission factors'!$C:$BQ,21,FALSE),\"\")","v":""},{"$f":"IFERROR(VLOOKUP($M21,'Emission factors'!$C:$BQ,24,FALSE),\"\")","v":""},{"$f":"IFERROR(VLOOKUP($M21,'Emission factors'!$C:$BQ,27,FALSE),\"\")","v":""},{"$f":"IFERROR(VLOOKUP($M21,'Emission factors'!$C:$BQ,30,FALSE),\"\")","v":""},{"$f":"IFERROR(VLOOKUP($M21,'Emission factors'!$C:$BQ,33,FALSE),\"\")","v":""},{"$f":"IFERROR(VLOOKUP($M21,'Emission factors'!$C:$BQ,36,FALSE),\"\")","v":""},{"$f":"IFERROR(VLOOKUP($M21,'Emission factors'!$C:$BQ,39,FALSE),\"\")","v":""},{"$f":"IFERROR(VLOOKUP($M21,'Emission factors'!$C:$BQ,42,FALSE),\"\")","v":""},{"$f":"IFERROR(VLOOKUP($M21,'Emission factors'!$C:$BQ,45,FALSE),\"\")","v":""},{"$f":"IFERROR(VLOOKUP($M21,'Emission factors'!$C:$BQ,48,FALSE),\"\")","v":""},{"$f":"IFERROR(VLOOKUP($M21,'Emission factors'!$C:$BQ,51,FALSE),\"\")","v":""},{"$f":"IFERROR(VLOOKUP($M21,'Emission factors'!$C:$BQ,54,FALSE),\"\")","v":""},{"$f":"IFERROR(VLOOKUP($M21,'Emission factors'!$C:$BQ,57,FALSE),\"\")","v":""},{"$f":"IFERROR(VLOOKUP($M21,'Emission factors'!$C:$BQ,60,FALSE),\"\")","v":""},{"$f":"IFERROR(VLOOKUP($M21,'Emission factors'!$C:$BQ,63,FALSE),\"\")","v":""},{"$f":"IFERROR(VLOOKUP($M21,'Emission factors'!$C:$BQ,65,FALSE),\"\")","v":""},{"$f":"IFERROR(VLOOKUP($M21,'Emission factors'!$C:$BQ,67,FALSE),\"\")","v":""},"✓",null,null,null,null,null,null,null,{"$f":"'[8]Internal ICF Summary'!$D$4","v":40378.275523450648},null,"-","-","-",{"$f":"IFERROR(IF(AND($M21=\"\",$AJ21=\"\"),\"\",IF($M21=\"\",IF(AN21=0,\"-\",AN21),IF(AND(R21=0,S21=0),\"0\",$G21*IF($K21=\"\",1,$K21)*(R21+S21)))),\"-\")","v":"-"},{"$f":"IFERROR(IF(AND($M21=\"\",$AJ21=\"\"),\"\",IF($M21=\"\",IF(AO21=0,\"-\",AO21),IF(AND(T21=0,U21=0,V21=0,W21=0,X21=0,Y21=0,Z21=0,AA21=0,AB21=0,AC21=0,AD21=0,AE21=0),\"0\",$G21*IF($K21=\"\",1,$K21)*(T21+U21+V21+W21+X21+Y21+Z21+AA21+AB21+AC21+AD21+AE21)))),\"-\")","v":"-"},"-","-",{"$f":"IFERROR(IF(AND($M21=\"\",$AJ21=\"\"),\"\",IF($M21=\"\",IF(AR21=\"\",SUM(AT21:AZ21),IF(AR21=0,\"0\",AR21)),IF($AH21=\"\",SUM($AT21:$AZ21),IF($AH21=0,\"0\",$G21*IF($K21=\"\",1,$K21)*$AH21)))),\"-\")","v":40378.275523450648},{"$f":"IFERROR(IF(AND($M21=\"\",$AJ21=\"\"),\"\",IF($M21=\"\",IF(AS21=0,\"-\",AS21),IF(AI21=0,\"0\",$G21*IF($K21=\"\",1,$K21)*AI21))),\"-\")","v":"-"}]
[]
[null,"IV. MACRO"]

{"sheet":"V - AFOLU","index":9,"n_rows":30,"n_cols":35,"rows_kept":30,"cut":false,"hidden":false,"merged":[[7,11,8,11],[15,11,16,11],[23,11,24,11],[1,33,1,34],[3,33,4,34],[3,12,4,12],[3,19,4,19],[7,13,7,18],[7,19,8,19],[7,20,7,24],[7,32,8,32],[7,33,8,33],[7,34,8,34],[15,33,16,33],[15,34,16,34],[23,33,24,33],[1,6,1,7],[3,6,4,7],[7,8,7,10],[15,8,15,10],[23,8,23,10],[7,1,8,1],[7,2,8,2],[7,3,7,4],[7,5,8,5],[7,6,7,7],[23,19,24,19],[23,20,23,24],[15,1,16,1],[15,2,16,2],[23,1,24,1],[23,2,24,2],[23,3,23,4],[23,5,24,5],[23,6,23,7],[15,3,15,4],[15,5,16,5],[15,6,15,7],[23,34,24,34],[7,12,8,12],[15,12,16,12],[23,12,24,12],[15,25,15,29],[15,30,15,31],[15,32,16,32],[23,32,24,32],[7,25,7,29],[7,30,7,31],[23,25,23,29],[23,30,23,31],[15,13,15,18],[15,19,16,19],[15,20,15,24],[23,13,23,18]]}
[]
[null,"V. AFOLU",null,null,null,null,"",null,null,null,null,null,"",null,null,null,null,null,null,"",null,null,null,null,null,null,null,null,null,null,null,null,null,""]
[]
[null,"Use this tab to record activity and emissions data for AFOLU sources. This is required for BASIC+ only. Emission factors should be recorded in the 'Emission factors' tab.",null,null,null,null,"Convert activity data units",null,null,null,null,null,"View emission factor(s)",null,null,null,null,null,null,"Enter emissions data",null,null,null,null,null,null,null,null,null,null,null,null,null,"Data quality explanation (optional)"]
[]
[null,"V.1 LIVESTOCK"]
[]
[null,"GPC ref No.","Scope","GHG Emissions Source",null,"Notation \nkeys","Activity data",null,"Activity data multiplier",null,null,"Gas(es)","Emission factor","Emission factor",null,null,null,null,null,"Emissions data","GHGs (metric tonnes CO2e)",null,null,null,null,"GHGs (metric tonnes CO2e)",null,null,null,null,"Data Quality",null,"Description of method(s) used or explanation for using notation key(s)","Source","Data quality explanation (optional)"]
[null,null,null,"Activity","Description",null,"Amount","Units","From","To","Factor",null,null,"Units","CO2","CH4","N2O","Total tCO2e","CO2(b)",null,"CO2","CH4","N2O","Total tCO2e","CO2(b)","CO2","CH4","N2O","Total tCO2e","CO2(b)","AD","EF"]
[null,"V.1",1,"Emissions from livestock",null,"NE",null,null,null,null,null,null,null,null,null,null,null,null,null,null,null,null,null,null,null,null,null,null,null,null,null,null,"V.1 has not been estimated; activity not required for BASIC"]
[null,"V.1",1,null,null,null,null,null,null,null,null,null,null,{"$f":"IFERROR(CONCATENATE(\"tCO2e/\",VLOOKUP($M11,'Emission factors'!$C:$H,6,FALSE)),\"\")","v":""},{"$f":"IFERROR(VLOOKUP($M11,'Emission factors'!$C:$BQ,9,FALSE),\"\")","v":""},{"$f":"IFERROR(VLOOKUP($M11,'Emission factors'!$C:$BQ,12,FALSE),\"\")","v":""},{"$f":"IFERROR(VLOOKUP($M11,'Emission factors'!$C:$BQ,15,FALSE),\"\")","v":""},{"$f":"IFERROR(VLOOKUP($M11,'Emission factors'!$C:$BQ,65,FALSE),\"\")","v":""},{"$f":"IFERROR(VLOOKUP($M11,'Emission factors'!$C:$BQ,67,FALSE),\"\")","v":""},null,null,null,null,null,null,{"$f":"IFERROR(IF(AND($M11=\"\",$T11=\"\"),\"\",IF($M11=\"\",IF(U11=0,\"-\",U11),IF(O11=0,\"0\",$G11*IF($K11=\"\",1,$K11)*O11))),\"-\")","v":""},"","",{"$f":"IFERROR(IF(AND($M11=\"\",$T11=\"\"),\"\",IF($M11=\"\",IF(X11=\"\",SUM(U11:W11),IF(X11=0,\"0\",X11)),IF($R11=\"\",SUM($Z11:$AB11),IF($R11=0,\"0\",$G11*IF($K11=\"\",1,$K11)*$R11)))),\"-\")","v":""},{"$f":"IFERROR(IF(AND($M11=\"\",$T11=\"\"),\"\",IF($M11=\"\",IF(Y11=0,\"-\",Y11),IF(S11=0,\"0\",$G11*IF($K11=\"\",1,$K11)*S11))),\"-\")","v":""}]
[null,"V.1",1,null,null,null,null,null,null,null,null,null,null,{"$f":"IFERROR(CONCATENATE(\"tCO2e/\",VLOOKUP(M12,'Emission factors'!C:H,6,FALSE)),\"\")","v":""},{"$f":"IFERROR(VLOOKUP($M12,'Emission factors'!$C:$BQ,9,FALSE),\"\")","v":""},{"$f":"IFERROR(VLOOKUP($M12,'Emission factors'!$C:$BQ,12,FALSE),\"\")","v":""},{"$f":"IFERROR(VLOOKUP($M12,'Emission factors'!$C:$BQ,15,FALSE),\"\")","v":""},{"$f":"IFERROR(VLOOKUP($M12,'Emission factors'!$C:$BQ,65,FALSE),\"\")","v":""},{"$f":"IFERROR(VLOOKUP($M12,'Emission factors'!$C:$BQ,67,FALSE),\"\")","v":""},null,null,null,null,null,null,"","","",{"$f":"IFERROR(IF(AND($M12=\"\",$T12=\"\"),\"\",IF($M12=\"\",IF(X12=\"\",SUM(U12:W12),IF(X12=0,\"0\",X12)),IF($R12=\"\",SUM($Z12:$AB12),IF($R12=0,\"0\",$G12*IF($K12=\"\",1,$K12)*$R12)))),\"-\")","v":""},{"$f":"IFERROR(IF(AND($M12=\"\",$T12=\"\"),\"\",IF($M12=\"\",IF(Y12=0,\"-\",Y12),IF(S12=0,\"0\",$G12*IF($K12=\"\",1,$K12)*S12))),\"-\")","v":""}]
[]
[null,"V.2 LAND"]
[]
[null,"GPC ref No.","Scope","GHG Emissions Source",null,"Notation \nkeys","Activity data",null,"Activity data multiplier",null,null,"Gas(es)","Emission factor","Emission factor",null,null,null,null,null,"Emissions data","GHGs (metric tonnes CO2e)",null,null,null,null,"GHGs (metric tonnes CO2e)",null,null,null,null,"Data Quality",null,"Description of method(s) used or explanation for using notation key(s)","Source","Data quality explanation (optional)"]
[null,null,null,"Activity","Description",null,"Amount","Units","From","To","Factor",null,null,"Units","CO2","CH4","N2O","Total tCO2e","CO2(b)",null,"CO2","CH4","N2O","Total tCO2e","CO2(b)","CO2","CH4","N2O","Total tCO2e","CO2(b)","AD","EF"]
[null,"V.2",1,"Emissions from land",null,"NE",null,null,null,null,null,null,null,null,null,null,null,null,null,null,null,null,null,null,null,null,null,null,null,null,null,null,"V.2 has not been estimated; activity not required for BASIC"]
[null,"V.2",1,null,null,null,null,null,null,null,null,null,null,{"$f":"IFERROR(CONCATENATE(\"tCO2e/\",VLOOKUP($M19,'Emission factors'!$C:$H,6,FALSE)),\"\")","v":""},{"$f":"IFERROR(VLOOKUP($M19,'Emission factors'!$C:$BQ,9,FALSE),\"\")","v":""},{"$f":"IFERROR(VLOOKUP($M19,'Emission factors'!$C:$BQ,12,FALSE),\"\")","v":""},{"$f":"IFERROR(VLOOKUP($M19,'Emission factors'!$C:$BQ,15,FALSE),\"\")","v":""},{"$f":"IFERROR(VLOOKUP($M19,'Emission factors'!$C:$BQ,65,FALSE),\"\")","v":""},{"$f":"IFERROR(VLOOKUP($M19,'Emission factors'!$C:$BQ,67,FALSE),\"\")","v":""},null,null,null,null,null,null,{"$f":"IFERROR(IF(AND($M19=\"\",$T19=\"\"),\"\",IF($M19=\"\",IF(U19=0,\"-\",U19),IF(O19=0,\"0\",$G19*IF($K19=\"\",1,$K19)*O19))),\"-\")","v":""},"","",{"$f":"IFERROR(IF(AND($M19=\"\",$T19=\"\"),\"\",IF($M19=\"\",IF(X19=\"\",SUM(U19:W19),IF(X19=0,\"0\",X19)),IF($R19=\"\",SUM($Z19:$AB19),IF($R19=0,\"0\",$G19*IF($K19=\"\",1,$K19)*$R19)))),\"-\")","v":""},{"$f":"IFERROR(IF(AND($M19=\"\",$T19=\"\"),\"\",IF($M19=\"\",IF(Y19=0,\"-\",Y19),IF(S19=0,\"0\",$G19*IF($K19=\"\",1,$K19)*S19))),\"-\")","v":""}]
[null,"V.2",1,null,null,null,null,null,null,null,null,null,null,{"$f":"IFERROR(CONCATENATE(\"tCO2e/\",VLOOKUP(M20,'Emission factors'!C:H,6,FALSE)),\"\")","v":""},{"$f":"IFERROR(VLOOKUP($M20,'Emission factors'!$C:$BQ,9,FALSE),\"\")","v":""},{"$f":"IFERROR(VLOOKUP($M20,'Emission factors'!$C:$BQ,12,FALSE),\"\")","v":""},{"$f":"IFERROR(VLOOKUP($M20,'Emission factors'!$C:$BQ,15,FALSE),\"\")","v":""},{"$f":"IFERROR(VLOOKUP($M20,'Emission factors'!$C:$BQ,65,FALSE),\"\")","v":""},{"$f":"IFERROR(VLOOKUP($M20,'Emission factors'!$C:$BQ,67,FALSE),\"\")","v":""},null,null,null,null,null,null,"","","",{"$f":"IFERROR(IF(AND($M20=\"\",$T20=\"\"),\"\",IF($M20=\"\",IF(X20=\"\",SUM(U20:W20),IF(X20=0,\"0\",X20)),IF($R20=\"\",SUM($Z20:$AB20),IF($R20=0,\"0\",$G20*IF($K20=\"\",1,$K20)*$R20)))),\"-\")","v":""},{"$f":"IFERROR(IF(AND($M20=\"\",$T20=\"\"),\"\",IF($M20=\"\",IF(Y20=0,\"-\",Y20),IF(S20=0,\"0\",$G20*IF($K20=\"\",1,$K20)*S20))),\"-\")","v":""}]
[]
[null,"V.3 AGGREGATE SOURCES"]
[]
[null,"GPC ref No.","Scope","GHG Emissions Source",null,"Notation \nkeys","Activity data",null,"Activity data multiplier",null,null,"Gas(es)","Emission factor","Emission factor",null,null,null,null,null,"Emissions data","GHGs (metric tonnes CO2e)",null,null,null,null,"GHGs (metric tonnes CO2e)",null,null,null,null,"Data Quality",null,"Description of method(s) used or explanation for using notation key(s)","Source","Data quality explanation (optional)"]
[null,null,null,"Activity","Description",null,"Amount","Units","From","To","Factor",null,null,"Units","CO2","CH4","N2O","Total tCO2e","CO2(b)",null,"CO2","CH4","N2O","Total tCO2e","CO2(b)","CO2","CH4","N2O","Total tCO2e","CO2(b)","AD","EF"]
[null,"V.3",1,"Emissions from aggregate sources and non-CO2 emission sources on land",null,"NE",null,null,null,null,null,null,null,null,null,null,null,null,null,null,null,null,null,null,null,null,null,null,null,null,null,null,"V.3 has not been estimated; activity not required for BASIC"]
[null,"V.3",1,null,null,null,null,null,null,null,null,null,null,{"$f":"IFERROR(CONCATENATE(\"tCO2e/\",VLOOKUP($M27,'Emission factors'!$C:$H,6,FALSE)),\"\")","v":""},{"$f":"IFERROR(VLOOKUP($M27,'Emission factors'!$C:$BQ,9,FALSE),\"\")","v":""},{"$f":"IFERROR(VLOOKUP($M27,'Emission factors'!$C:$BQ,12,FALSE),\"\")","v":""},{"$f":"IFERROR(VLOOKUP($M27,'Emission factors'!$C:$BQ,15,FALSE),\"\")","v":""},{"$f":"IFERROR(VLOOKUP($M27,'Emission factors'!$C:$BQ,65,FALSE),\"\")","v":""},{"$f":"IFERROR(VLOOKUP($M27,'Emission factors'!$C:$BQ,67,FALSE),\"\")","v":""},null,null,null,null,null,null,{"$f":"IFERROR(IF(AND($M27=\"\",$T27=\"\"),\"\",IF($M27=\"\",IF(U27=0,\"-\",U27),IF(O27=0,\"0\",$G27*IF($K27=\"\",1,$K27)*O27))),\"-\")","v":""},"","",{"$f":"IFERROR(IF(AND($M27=\"\",$T27=\"\"),\"\",IF($M27=\"\",IF(X27=\"\",SUM(U27:W27),IF(X27=0,\"0\",X27)),IF($R27=\"\",SUM($Z27:$AB27),IF($R27=0,\"0\",$G27*IF($K27=\"\",1,$K27)*$R27)))),\"-\")","v":""},{"$f":"IFERROR(IF(AND($M27=\"\",$T27=\"\"),\"\",IF($M27=\"\",IF(Y27=0,\"-\",Y27),IF(S27=0,\"0\",$G27*IF($K27=\"\",1,$K27)*S27))),\"-\")","v":""}]
[null,"V.3",1,null,null,null,null,null,null,null,null,null,null,{"$f":"IFERROR(CONCATENATE(\"tCO2e/\",VLOOKUP(M28,'Emission factors'!C:H,6,FALSE)),\"\")","v":""},{"$f":"IFERROR(VLOOKUP($M28,'Emission factors'!$C:$BQ,9,FALSE),\"\")","v":""},{"$f":"IFERROR(VLOOKUP($M28,'Emission factors'!$C:$BQ,12,FALSE),\"\")","v":""},{"$f":"IFERROR(VLOOKUP($M28,'Emission factors'!$C:$BQ,15,FALSE),\"\")","v":""},{"$f":"IFERROR(VLOOKUP($M28,'Emission factors'!$C:$BQ,65,FALSE),\"\")","v":""},{"$f":"IFERROR(VLOOKUP($M28,'Emission factors'!$C:$BQ,67,FALSE),\"\")","v":""},null,null,null,null,null,null,"","","",{"$f":"IFERROR(IF(AND($M28=\"\",$T28=\"\"),\"\",IF($M28=\"\",IF(X28=\"\",SUM(U28:W28),IF(X28=0,\"0\",X28)),IF($R28=\"\",SUM($Z28:$AB28),IF($R28=0,\"0\",$G28*IF($K28=\"\",1,$K28)*$R28)))),\"-\")","v":""},{"$f":"IFERROR(IF(AND($M28=\"\",$T28=\"\"),\"\",IF($M28=\"\",IF(Y28=0,\"-\",Y28),IF(S28=0,\"0\",$G28*IF($K28=\"\",1,$K28)*S28))),\"-\")","v":""}]
[]
[null,"V. MACRO"]

{"sheet":"VI - Other scope 3","index":10,"n_rows":14,"n_cols":59,"rows_kept":14,"cut":false,"hidden":false,"merged":[[3,12,4,12],[3,35,4,35],[7,45,7,53],[7,13,7,34],[1,57,1,58],[3,57,4,58],[7,57,8,57],[7,58,8,58],[7,12,8,12],[7,36,7,44],[7,54,7,55],[7,56,8,56],[7,35,8,35],[3,16,4,16],[1,6,1,7],[3,6,4,7],[7,8,7,10],[7,11,8,11],[7,1,8,1],[7,2,8,2],[7,3,7,4],[7,5,8,5],[7,6,7,7]]}
[]
[null,"VI. OTHER SCOPE 3",null,null,null,null,"",null,null,null,null,null,"",null,null,null,"",null,null,null,null,null,null,null,null,null,null,null,null,null,null,null,null,null,null,"",null,null,null,null,null,null,null,null,null,null,null,null,null,null,null,null,null,null,null,null,null,""]
[]
[null,"Use this tab to record activity and emissions data for Other scope 3 sources. This sector is optional. Emission factors should be recorded in the 'Emission factors' tab.",null,null,null,null,"Convert activity data units",null,null,null,null,null,"View emission factor(s)",null,null,null,"F-gases",null,null,null,null,null,null,null,null,null,null,null,null,null,null,null,null,null,null,"Enter emissions data",null,null,null,null,null,null,null,null,null,null,null,null,null,null,null,null,null,null,null,null,null,"Data quality explanation (optional)"]
[]
[null,"VI.1 OTHER SCOPE 3"]
[]
[null,"GPC ref No.","Scope","GHG Emissions Source",null,"Notation \nkeys","Activity data",null,"Activity data multiplier",null,null,"Gas(es)","Emission factor","Emission factor",null,null,null,null,null,null,null,null,null,null,null,null,null,null,null,null,null,null,null,null,null,"Emissions data","GHGs (metric tonnes CO2e)",null,null,null,null,null,null,null,null,"GHGs (metric tonnes CO2e)",null,null,null,null,null,null,null,null,"Data Quality",null,"Description of method(s) used or explanation for using notation key(s)","Source","Data quality explanation (optional)"]
[null,null,null,"Activity","Description",null,"Amount","Units","From","To","Factor",null,null,"Units","CO2","CH4","N2O","CF4","C2F6","HFC-23","HFC-32","HFC-41","HFC-125","HFC-134","HFC-134a","HFC-143","HFC-143a","HFC-152a","HFC-227ea","HFC-236fa","HFC-245ca","SF6","NF3","Total tCO2e","CO2(b)",null,"CO2","CH4","N2O","PFC","HFC","SF6","NF3","Total tCO2e","CO2(b)","CO2","CH4","N2O","PFC","HFC","SF6","NF3","Total tCO2e","CO2(b)","AD","EF"]
[null,"VI.1",3,"Other Scope 3",null,"NE",null,null,null,null,null,null,null,null,null,null,null,null,null,null,null,null,null,null,null,null,null,null,null,null,null,null,null,null,null,null,null,null,null,null,null,null,null,null,null,null,null,null,null,null,null,null,null,null,null,null,"VI.1 has not been estimated; activity not required for BASIC"]
[null,"VI.1",3,null,null,null,null,null,null,null,null,null,null,{"$f":"IFERROR(CONCATENATE(\"tCO2e/\",VLOOKUP($M11,'Emission factors'!$C:$H,6,FALSE)),\"\")","v":""},{"$f":"IFERROR(VLOOKUP($M11,'Emission factors'!$C:$BQ,9,FALSE),\"\")","v":""},{"$f":"IFERROR(VLOOKUP($M11,'Emission factors'!$C:$BQ,12,FALSE),\"\")","v":""},{"$f":"IFERROR(VLOOKUP($M11,'Emission factors'!$C:$BQ,15,FALSE),\"\")","v":""},{"$f":"IFERROR(VLOOKUP($M11,'Emission factors'!$C:$BQ,18,FALSE),\"\")","v":""},{"$f":"IFERROR(VLOOKUP($M11,'Emission factors'!$C:$BQ,21,FALSE),\"\")","v":""},{"$f":"IFERROR(VLOOKUP($M11,'Emission factors'!$C:$BQ,24,FALSE),\"\")","v":""},{"$f":"IFERROR(VLOOKUP($M11,'Emission factors'!$C:$BQ,27,FALSE),\"\")","v":""},{"$f":"IFERROR(VLOOKUP($M11,'Emission factors'!$C:$BQ,30,FALSE),\"\")","v":""},{"$f":"IFERROR(VLOOKUP($M11,'Emission factors'!$C:$BQ,33,FALSE),\"\")","v":""},{"$f":"IFERROR(VLOOKUP($M11,'Emission factors'!$C:$BQ,36,FALSE),\"\")","v":""},{"$f":"IFERROR(VLOOKUP($M11,'Emission factors'!$C:$BQ,39,FALSE),\"\")","v":""},{"$f":"IFERROR(VLOOKUP($M11,'Emission factors'!$C:$BQ,42,FALSE),\"\")","v":""},{"$f":"IFERROR(VLOOKUP($M11,'Emission factors'!$C:$BQ,45,FALSE),\"\")","v":""},{"$f":"IFERROR(VLOOKUP($M11,'Emission factors'!$C:$BQ,48,FALSE),\"\")","v":""},{"$f":"IFERROR(VLOOKUP($M11,'Emission factors'!$C:$BQ,51,FALSE),\"\")","v":""},{"$f":"IFERROR(VLOOKUP($M11,'Emission factors'!$C:$BQ,54,FALSE),\"\")","v":""},{"$f":"IFERROR(VLOOKUP($M11,'Emission factors'!$C:$BQ,57,FALSE),\"\")","v":""},{"$f":"IFERROR(VLOOKUP($M11,'Emission factors'!$C:$BQ,60,FALSE),\"\")","v":""},{"$f":"IFERROR(VLOOKUP($M11,'Emission factors'!$C:$BQ,63,FALSE),\"\")","v":""},{"$f":"IFERROR(VLOOKUP($M11,'Emission factors'!$C:$BQ,65,FALSE),\"\")","v":""},{"$f":"IFERROR(VLOOKUP($M11,'Emission factors'!$C:$BQ,67,FALSE),\"\")","v":""},null,null,null,null,null,null,null,null,null,null,{"$f":"IFERROR(IF(AND($M11=\"\",$AJ11=\"\"),\"\",IF($M11=\"\",IF(AK11=0,\"-\",AK11),IF(O11=0,\"0\",$G11*IF($K11=\"\",1,$K11)*O11))),\"-\")","v":""},"","",{"$f":"IFERROR(IF(AND($M11=\"\",$AJ11=\"\"),\"\",IF($M11=\"\",IF(AN11=0,\"-\",AN11),IF(AND(R11=0,S11=0),\"0\",$G11*IF($K11=\"\",1,$K11)*(R11+S11)))),\"-\")","v":""},{"$f":"IFERROR(IF(AND($M11=\"\",$AJ11=\"\"),\"\",IF($M11=\"\",IF(AO11=0,\"-\",AO11),IF(AND(T11=0,U11=0,V11=0,W11=0,X11=0,Y11=0,Z11=0,AA11=0,AB11=0,AC11=0,AD11=0,AE11=0),\"0\",$G11*IF($K11=\"\",1,$K11)*(T11+U11+V11+W11+X11+Y11+Z11+AA11+AB11+AC11+AD11+AE11)))),\"-\")","v":""},{"$f":"IFERROR(IF(AND($M11=\"\",$AJ11=\"\"),\"\",IF($M11=\"\",IF(AP11=0,\"-\",AP11),IF(AF11=0,\"0\",$G11*IF($K11=\"\",1,$K11)*AF11))),\"-\")","v":""},{"$f":"IFERROR(IF(AND($M11=\"\",$AJ11=\"\"),\"\",IF($M11=\"\",IF(AQ11=0,\"-\",AQ11),IF(AG11=0,\"0\",$G11*IF($K11=\"\",1,$K11)*AG11))),\"-\")","v":""},{"$f":"IFERROR(IF(AND($M11=\"\",$AJ11=\"\"),\"\",IF($M11=\"\",IF(AR11=\"\",SUM(AT11:AZ11),IF(AR11=0,\"0\",AR11)),IF($AH11=\"\",SUM($AT11:$AZ11),IF($AH11=0,\"0\",$G11*IF($K11=\"\",1,$K11)*$AH11)))),\"-\")","v":""},{"$f":"IFERROR(IF(AND($M11=\"\",$AJ11=\"\"),\"\",IF($M11=\"\",IF(AS11=0,\"-\",AS11),IF(AI11=0,\"0\",$G11*IF($K11=\"\",1,$K11)*AI11))),\"-\")","v":""}]
[null,"VI.1",3,null,null,null,null,null,null,null,null,null,null,{"$f":"IFERROR(CONCATENATE(\"tCO2e/\",VLOOKUP($M12,'Emission factors'!$C:$H,6,FALSE)),\"\")","v":""},{"$f":"IFERROR(VLOOKUP($M12,'Emission factors'!$C:$BQ,9,FALSE),\"\")","v":""},{"$f":"IFERROR(VLOOKUP($M12,'Emission factors'!$C:$BQ,12,FALSE),\"\")","v":""},{"$f":"IFERROR(VLOOKUP($M12,'Emission factors'!$C:$BQ,15,FALSE),\"\")","v":""},{"$f":"IFERROR(VLOOKUP($M12,'Emission factors'!$C:$BQ,18,FALSE),\"\")","v":""},{"$f":"IFERROR(VLOOKUP($M12,'Emission factors'!$C:$BQ,21,FALSE),\"\")","v":""},{"$f":"IFERROR(VLOOKUP($M12,'Emission factors'!$C:$BQ,24,FALSE),\"\")","v":""},{"$f":"IFERROR(VLOOKUP($M12,'Emission factors'!$C:$BQ,27,FALSE),\"\")","v":""},{"$f":"IFERROR(VLOOKUP($M12,'Emission factors'!$C:$BQ,30,FALSE),\"\")","v":""},{"$f":"IFERROR(VLOOKUP($M12,'Emission factors'!$C:$BQ,33,FALSE),\"\")","v":""},{"$f":"IFERROR(VLOOKUP($M12,'Emission factors'!$C:$BQ,36,FALSE),\"\")","v":""},{"$f":"IFERROR(VLOOKUP($M12,'Emission factors'!$C:$BQ,39,FALSE),\"\")","v":""},{"$f":"IFERROR(VLOOKUP($M12,'Emission factors'!$C:$BQ,42,FALSE),\"\")","v":""},{"$f":"IFERROR(VLOOKUP($M12,'Emission factors'!$C:$BQ,45,FALSE),\"\")","v":""},{"$f":"IFERROR(VLOOKUP($M12,'Emission factors'!$C:$BQ,48,FALSE),\"\")","v":""},{"$f":"IFERROR(VLOOKUP($M12,'Emission factors'!$C:$BQ,51,FALSE),\"\")","v":""},{"$f":"IFERROR(VLOOKUP($M12,'Emission factors'!$C:$BQ,54,FALSE),\"\")","v":""},{"$f":"IFERROR(VLOOKUP($M12,'Emission factors'!$C:$BQ,57,FALSE),\"\")","v":""},{"$f":"IFERROR(VLOOKUP($M12,'Emission factors'!$C:$BQ,60,FALSE),\"\")","v":""},{"$f":"IFERROR(VLOOKUP($M12,'Emission factors'!$C:$BQ,63,FALSE),\"\")","v":""},{"$f":"IFERROR(VLOOKUP($M12,'Emission factors'!$C:$BQ,65,FALSE),\"\")","v":""},{"$f":"IFERROR(VLOOKUP($M12,'Emission factors'!$C:$BQ,67,FALSE),\"\")","v":""},null,null,null,null,null,null,null,null,null,null,"","","",{"$f":"IFERROR(IF(AND($M12=\"\",$AJ12=\"\"),\"\",IF($M12=\"\",IF(AN12=0,\"-\",AN12),IF(AND(R12=0,S12=0),\"0\",$G12*IF($K12=\"\",1,$K12)*(R12+S12)))),\"-\")","v":""},{"$f":"IFERROR(IF(AND($M12=\"\",$AJ12=\"\"),\"\",IF($M12=\"\",IF(AO12=0,\"-\",AO12),IF(AND(T12=0,U12=0,V12=0,W12=0,X12=0,Y12=0,Z12=0,AA12=0,AB12=0,AC12=0,AD12=0,AE12=0),\"0\",$G12*IF($K12=\"\",1,$K12)*(T12+U12+V12+W12+X12+Y12+Z12+AA12+AB12+AC12+AD12+AE12)))),\"-\")","v":""},{"$f":"IFERROR(IF(AND($M12=\"\",$AJ12=\"\"),\"\",IF($M12=\"\",IF(AP12=0,\"-\",AP12),IF(AF12=0,\"0\",$G12*IF($K12=\"\",1,$K12)*AF12))),\"-\")","v":""},{"$f":"IFERROR(IF(AND($M12=\"\",$AJ12=\"\"),\"\",IF($M12=\"\",IF(AQ12=0,\"-\",AQ12),IF(AG12=0,\"0\",$G12*IF($K12=\"\",1,$K12)*AG12))),\"-\")","v":""},{"$f":"IFERROR(IF(AND($M12=\"\",$AJ12=\"\"),\"\",IF($M12=\"\",IF(AR12=\"\",SUM(AT12:AZ12),IF(AR12=0,\"0\",AR12)),IF($AH12=\"\",SUM($AT12:$AZ12),IF($AH12=0,\"0\",$G12*IF($K12=\"\",1,$K12)*$AH12)))),\"-\")","v":""},{"$f":"IFERROR(IF(AND($M12=\"\",$AJ12=\"\"),\"\",IF($M12=\"\",IF(AS12=0,\"-\",AS12),IF(AI12=0,\"0\",$G12*IF($K12=\"\",1,$K12)*AI12))),\"-\")","v":""}]
[]
[null,"VI. MACRO"]

{"sheet":"Table A. Overview","index":11,"n_rows":87,"n_cols":15,"rows_kept":87,"cut":false,"hidden":false,"merged":[[7,14,8,14],[7,1,8,1],[7,2,8,2],[7,3,8,3],[7,5,7,13],[7,4,8,4]]}
[]
[null,"GPC GHG Overview"]
[]
[null,"NAME OF CITY:",null,{"$f":"IF('City information'!C10=\"\",'City information'!C9,CONCATENATE('City information'!C9,\", \",'City information'!C10))","v":"Chicago, USA"}]
[null,"BOUNDARY:",null,{"$f":"'City information'!C12","v":"Administrative boundary of a local government "}]
[null,"INVENTORY YEAR:",null,{"$f":"'City information'!C11","v":2010}]
[]
[null,"GPC ref No.","Scope","GHG Emissions Source (By Sector and Sub-sector)","Notation \nkeys","GHGs (metric tonnes CO2e)",null,null,null,null,null,null,null,null,"Description of method(s) used or explanation for using notation key(s)"]
[null,null,null,null,null,"CO2","CH4","N2O","PFC","HFC","SF6","NF3","Total tCO2e","CO2(b)"]
[]
[null,"I",null,"STATIONARY ENERGY "]
[null,"I.1",null,"Residential buildings"]
[null,"I.1.1",1,"Emissions from fuel combustion within the city boundary",{"$f":"IF(VLOOKUP($B13,'I - Stationary'!$B:$F,5,FALSE)=\"\",\"\",VLOOKUP($B13,'I - Stationary'!$B:$F,5,FALSE))","v":""},{"$f":"SUMIF('I - Stationary'!$B:$B,$B13,'I - Stationary'!Z:Z)","v":5481388.1001687609},{"$f":"SUMIF('I - Stationary'!$B:$B,$B13,'I - Stationary'!AA:AA)","v":197057.38762245153},{"$f":"SUMIF('I - Stationary'!$B:$B,$B13,'I - Stationary'!AB:AB)","v":3093.252294107444},null,null,null,null,{"$f":"SUMIF('I - Stationary'!$B:$B,$B13,'I - Stationary'!AC:AC)","v":5715207.9086837154},{"$f":"SUMIF('I - Stationary'!$B:$B,$B13,'I - Stationary'!AD:AD)","v":0},{"$f":"IF(VLOOKUP($B13,'I - Stationary'!$B:$AG,32,FALSE)=\"\",\"\",VLOOKUP($B13,'I - Stationary'!$B:$AG,32,FALSE))","v":""}]
[null,"I.1.2",2,"Emissions from grid-supplied energy consumed within the city boundary",{"$f":"IF(VLOOKUP(B14,'I - Stationary'!$B:$F,5,FALSE)=\"\",\"\",VLOOKUP(B14,'I - Stationary'!$B:$F,5,FALSE))","v":""},{"$f":"SUMIF('I - Stationary'!$B:$B,$B14,'I - Stationary'!Z:Z)","v":4040633.5540893688},{"$f":"SUMIF('I - Stationary'!$B:$B,$B14,'I - Stationary'!AA:AA)","v":1315.4151709050122},{"$f":"SUMIF('I - Stationary'!$B:$B,$B14,'I - Stationary'!AB:AB)","v":20784.734848206856},null,null,null,null,{"$f":"SUMIF('I - Stationary'!$B:$B,$B14,'I - Stationary'!AC:AC)","v":4062733.7041084813},{"$f":"SUMIF('I - Stationary'!$B:$B,$B14,'I - Stationary'!AD:AD)","v":0},{"$f":"IF(VLOOKUP($B14,'I - Stationary'!$B:$AG,32,FALSE)=\"\",\"\",VLOOKUP($B14,'I - Stationary'!$B:$AG,32,FALSE))","v":""}]
[null,"I.1.3",3,"Transmission and distribution losses from grid-supplied energy",{"$f":"IF(VLOOKUP(B15,'I - Stationary'!$B:$F,5,FALSE)=\"\",\"\",VLOOKUP(B15,'I - Stationary'!$B:$F,5,FALSE))","v":"NE"},{"$f":"SUMIF('I - Stationary'!$B:$B,$B15,'I - Stationary'!Z:Z)","v":0},{"$f":"SUMIF('I - Stationary'!$B:$B,$B15,'I - Stationary'!AA:AA)","v":0},{"$f":"SUMIF('I - Stationary'!$B:$B,$B15,'I - Stationary'!AB:AB)","v":0},null,null,null,null,{"$f":"SUMIF('I - Stationary'!$B:$B,$B15,'I - Stationary'!AC:AC)","v":0},{"$f":"SUMIF('I - Stationary'!$B:$B,$B15,'I - Stationary'!AD:AD)","v":0},{"$f":"IF(VLOOKUP($B15,'I - Stationary'!$B:$AG,32,FALSE)=\"\",\"\",VLOOKUP($B15,'I - Stationary'!$B:$AG,32,FALSE))","v":""}]
[null,"I.2",null,"Commercial and institutional buildings and facilities"]
[null,"I.2.1",1,"Emissions from fuel combustion within the city boundary",{"$f":"IF(VLOOKUP(B17,'I - Stationary'!$B:$F,5,FALSE)=\"\",\"\",VLOOKUP(B17,'I - Stationary'!$B:$F,5,FALSE))","v":""},{"$f":"SUMIF('I - Stationary'!$B:$B,$B17,'I - Stationary'!Z:Z)","v":2745758.7621255359},{"$f":"SUMIF('I - Stationary'!$B:$B,$B17,'I - Stationary'!AA:AA)","v":95765.084793294722},{"$f":"SUMIF('I - Stationary'!$B:$B,$B17,'I - Stationary'!AB:AB)","v":1940.0418844698463},null,null,null,null,{"$f":"SUMIF('I - Stationary'!$B:$B,$B17,'I - Stationary'!AC:AC)","v":2996949.1307490799},{"$f":"SUMIF('I - Stationary'!$B:$B,$B17,'I - Stationary'!AD:AD)","v":0},{"$f":"IF(VLOOKUP($B17,'I - Stationary'!$B:$AG,32,FALSE)=\"\",\"\",VLOOKUP($B17,'I - Stationary'!$B:$AG,32,FALSE))","v":""}]
[null,"I.2.2",2,"Emissions from grid-supplied energy consumed within the city boundary",{"$f":"IF(VLOOKUP(B18,'I - Stationary'!$B:$F,5,FALSE)=\"\",\"\",VLOOKUP(B18,'I - Stationary'!$B:$F,5,FALSE))","v":""},{"$f":"SUMIF('I - Stationary'!$B:$B,$B18,'I - Stationary'!Z:Z)","v":10688908.815124476},{"$f":"SUMIF('I - Stationary'!$B:$B,$B18,'I - Stationary'!AA:AA)","v":3479.7396565707163},{"$f":"SUMIF('I - Stationary'!$B:$B,$B18,'I - Stationary'!AB:AB)","v":54982.99525681496},null,null,null,null,{"$f":"SUMIF('I - Stationary'!$B:$B,$B18,'I - Stationary'!AC:AC)","v":10747371.550037861},{"$f":"SUMIF('I - Stationary'!$B:$B,$B18,'I - Stationary'!AD:AD)","v":0},{"$f":"IF(VLOOKUP($B18,'I - Stationary'!$B:$AG,32,FALSE)=\"\",\"\",VLOOKUP($B18,'I - Stationary'!$B:$AG,32,FALSE))","v":""}]
[null,"I.2.3",3,"Transmission and distribution losses from grid-supplied energy",{"$f":"IF(VLOOKUP(B19,'I - Stationary'!$B:$F,5,FALSE)=\"\",\"\",VLOOKUP(B19,'I - Stationary'!$B:$F,5,FALSE))","v":"NE"},{"$f":"SUMIF('I - Stationary'!$B:$B,$B19,'I - Stationary'!Z:Z)","v":0},{"$f":"SUMIF('I - Stationary'!$B:$B,$B19,'I - Stationary'!AA:AA)","v":0},{"$f":"SUMIF('I - Stationary'!$B:$B,$B19,'I - Stationary'!AB:AB)","v":0},null,null,null,null,{"$f":"SUMIF('I - Stationary'!$B:$B,$B19,'I - Stationary'!AC:AC)","v":0},{"$f":"SUMIF('I - Stationary'!$B:$B,$B19,'I - Stationary'!AD:AD)","v":0},{"$f":"IF(VLOOKUP($B19,'I - Stationary'!$B:$AG,32,FALSE)=\"\",\"\",VLOOKUP($B19,'I - Stationary'!$B:$AG,32,FALSE))","v":""}]
[null,"I.3",null,"Manufacturing industries and construction"]
[null,"I.3.1",1,"Emissions from fuel combustion within the city boundary",{"$f":"IF(VLOOKUP(B21,'I - Stationary'!$B:$F,5,FALSE)=\"\",\"\",VLOOKUP(B21,'I - Stationary'!$B:$F,5,FALSE))","v":""},{"$f":"SUMIF('I - Stationary'!$B:$B,$B21,'I - Stationary'!Z:Z)","v":868677.22757890017},{"$f":"SUMIF('I - Stationary'!$B:$B,$B21,'I - Stationary'!AA:AA)","v":31229.181737476611},{"$f":"SUMIF('I - Stationary'!$B:$B,$B21,'I - Stationary'!AB:AB)","v":490.21119795633501},null,null,null,null,{"$f":"SUMIF('I - Stationary'!$B:$B,$B21,'I - Stationary'!AC:AC)","v":1350940.5697192827},{"$f":"SUMIF('I - Stationary'!$B:$B,$B21,'I - Stationary'!AD:AD)","v":0},{"$f":"IF(VLOOKUP($B21,'I - Stationary'!$B:$AG,32,FALSE)=\"\",\"\",VLOOKUP($B21,'I - Stationary'!$B:$AG,32,FALSE))","v":""}]
[null,"I.3.2",2,"Emissions from grid-supplied energy consumed within the city boundary",{"$f":"IF(VLOOKUP(B22,'I - Stationary'!$B:$F,5,FALSE)=\"\",\"\",VLOOKUP(B22,'I - Stationary'!$B:$F,5,FALSE))","v":"IE"},{"$f":"SUMIF('I - Stationary'!$B:$B,$B22,'I - Stationary'!Z:Z)","v":0},{"$f":"SUMIF('I - Stationary'!$B:$B,$B22,'I - Stationary'!AA:AA)","v":0},{"$f":"SUMIF('I - Stationary'!$B:$B,$B22,'I - Stationary'!AB:AB)","v":0},null,null,null,null,{"$f":"SUMIF('I - Stationary'!$B:$B,$B22,'I - Stationary'!AC:AC)","v":0},{"$f":"SUMIF('I - Stationary'!$B:$B,$B22,'I - Stationary'!AD:AD)","v":0},{"$f":"IF(VLOOKUP($B22,'I - Stationary'!$B:$AG,32,FALSE)=\"\",\"\",VLOOKUP($B22,'I - Stationary'!$B:$AG,32,FALSE))","v":"I.3.2 is included in I.2.2"}]
[null,"I.3.3",3,"Transmission and distribution losses from grid-supplied energy",{"$f":"IF(VLOOKUP(B23,'I - Stationary'!$B:$F,5,FALSE)=\"\",\"\",VLOOKUP(B23,'I - Stationary'!$B:$F,5,FALSE))","v":"NE"},{"$f":"SUMIF('I - Stationary'!$B:$B,$B23,'I - Stationary'!Z:Z)","v":0},{"$f":"SUMIF('I - Stationary'!$B:$B,$B23,'I - Stationary'!AA:AA)","v":0},{"$f":"SUMIF('I - Stationary'!$B:$B,$B23,'I - Stationary'!AB:AB)","v":0},null,null,null,null,{"$f":"SUMIF('I - Stationary'!$B:$B,$B23,'I - Stationary'!AC:AC)","v":0},{"$f":"SUMIF('I - Stationary'!$B:$B,$B23,'I - Stationary'!AD:AD)","v":0},{"$f":"IF(VLOOKUP($B23,'I - Stationary'!$B:$AG,32,FALSE)=\"\",\"\",VLOOKUP($B23,'I - Stationary'!$B:$AG,32,FALSE))","v":""}]
[null,"I.4",null,"Energy industries"]
[null,"I.4.1",1,"Emissions from energy production used in power plant auxiliary operations within the city",{"$f":"IF(VLOOKUP(B25,'I - Stationary'!$B:$F,5,FALSE)=\"\",\"\",VLOOKUP(B25,'I - Stationary'!$B:$F,5,FALSE))","v":"NO"},{"$f":"SUMIF('I - Stationary'!$B:$B,$B25,'I - Stationary'!Z:Z)","v":0},{"$f":"SUMIF('I - Stationary'!$B:$B,$B25,'I - Stationary'!AA:AA)","v":0},{"$f":"SUMIF('I - Stationary'!$B:$B,$B25,'I - Stationary'!AB:AB)","v":0},null,null,null,null,{"$f":"SUMIF('I - Stationary'!$B:$B,$B25,'I - Stationary'!AC:AC)","v":0},{"$f":"SUMIF('I - Stationary'!$B:$B,$B25,'I - Stationary'!AD:AD)","v":0},{"$f":"IF(VLOOKUP($B25,'I - Stationary'!$B:$AG,32,FALSE)=\"\",\"\",VLOOKUP($B25,'I - Stationary'!$B:$AG,32,FALSE))","v":"I.4.1 does not occur"}]
[null,"I.4.2",2,"Emissions from grid-supplied energy consumed by energy industries",{"$f":"IF(VLOOKUP(B26,'I - Stationary'!$B:$F,5,FALSE)=\"\",\"\",VLOOKUP(B26,'I - Stationary'!$B:$F,5,FALSE))","v":"NO"},{"$f":"SUMIF('I - Stationary'!$B:$B,$B26,'I - Stationary'!Z:Z)","v":0},{"$f":"SUMIF('I - Stationary'!$B:$B,$B26,'I - Stationary'!AA:AA)","v":0},{"$f":"SUMIF('I - Stationary'!$B:$B,$B26,'I - Stationary'!AB:AB)","v":0},null,null,null,null,{"$f":"SUMIF('I - Stationary'!$B:$B,$B26,'I - Stationary'!AC:AC)","v":0},{"$f":"SUMIF('I - Stationary'!$B:$B,$B26,'I - Stationary'!AD:AD)","v":0},{"$f":"IF(VLOOKUP($B26,'I - Stationary'!$B:$AG,32,FALSE)=\"\",\"\",VLOOKUP($B26,'I - Stationary'!$B:$AG,32,FALSE))","v":"I.4.2 does not occur"}]
[null,"I.4.3",3,"Emissions from transmission and distribution losses from grid-supplied energy used in power plant auxiliary operations",{"$f":"IF(VLOOKUP(B27,'I - Stationary'!$B:$F,5,FALSE)=\"\",\"\",VLOOKUP(B27,'I - Stationary'!$B:$F,5,FALSE))","v":"NO"},{"$f":"SUMIF('I - Stationary'!$B:$B,$B27,'I - Stationary'!Z:Z)","v":0},{"$f":"SUMIF('I - Stationary'!$B:$B,$B27,'I - Stationary'!AA:AA)","v":0},{"$f":"SUMIF('I - Stationary'!$B:$B,$B27,'I - Stationary'!AB:AB)","v":0},null,null,null,null,{"$f":"SUMIF('I - Stationary'!$B:$B,$B27,'I - Stationary'!AC:AC)","v":0},{"$f":"SUMIF('I - Stationary'!$B:$B,$B27,'I - Stationary'!AD:AD)","v":0},{"$f":"IF(VLOOKUP($B27,'I - Stationary'!$B:$AG,32,FALSE)=\"\",\"\",VLOOKUP($B27,'I - Stationary'!$B:$AG,32,FALSE))","v":"I.4.3 does not occur"}]
[null,"I.4.4",1,"Emissions from energy generation supplied to the grid",{"$f":"IF(VLOOKUP(B28,'I - Stationary'!$B:$F,5,FALSE)=\"\",\"\",VLOOKUP(B28,'I - Stationary'!$B:$F,5,FALSE))","v":"NO"},{"$f":"SUMIF('I - Stationary'!$B:$B,$B28,'I - Stationary'!Z:Z)","v":0},{"$f":"SUMIF('I - Stationary'!$B:$B,$B28,'I - Stationary'!AA:AA)","v":0},{"$f":"SUMIF('I - Stationary'!$B:$B,$B28,'I - Stationary'!AB:AB)","v":0},null,null,null,null,{"$f":"SUMIF('I - Stationary'!$B:$B,$B28,'I - Stationary'!AC:AC)","v":0},{"$f":"SUMIF('I - Stationary'!$B:$B,$B28,'I - Stationary'!AD:AD)","v":0},{"$f":"IF(VLOOKUP($B28,'I - Stationary'!$B:$AG,32,FALSE)=\"\",\"\",VLOOKUP($B28,'I - Stationary'!$B:$AG,32,FALSE))","v":"I.4.4 does not occur"}]
[null,"I.5",null,"Agriculture, forestry and fishing activities"]
[null,"I.5.1",1,"Emissions from fuel combustion within the city boundary",{"$f":"IF(VLOOKUP(B30,'I - Stationary'!$B:$F,5,FALSE)=\"\",\"\",VLOOKUP(B30,'I - Stationary'!$B:$F,5,FALSE))","v":"NO"},{"$f":"SUMIF('I - Stationary'!$B:$B,$B30,'I - Stationary'!Z:Z)","v":0},{"$f":"SUMIF('I - Stationary'!$B:$B,$B30,'I - Stationary'!AA:AA)","v":0},{"$f":"SUMIF('I - Stationary'!$B:$B,$B30,'I - Stationary'!AB:AB)","v":0},null,null,null,null,{"$f":"SUMIF('I - Stationary'!$B:$B,$B30,'I - Stationary'!AC:AC)","v":0},{"$f":"SUMIF('I - Stationary'!$B:$B,$B30,'I - Stationary'!AD:AD)","v":0},{"$f":"IF(VLOOKUP($B30,'I - Stationary'!$B:$AG,32,FALSE)=\"\",\"\",VLOOKUP($B30,'I - Stationary'!$B:$AG,32,FALSE))","v":"I.5.1 does not occur; no agricultural activities within the city boundary"}]
[null,"I.5.2",2,"Emissions from grid-supplied energy consumed within the city boundary",{"$f":"IF(VLOOKUP(B31,'I - Stationary'!$B:$F,5,FALSE)=\"\",\"\",VLOOKUP(B31,'I - Stationary'!$B:$F,5,FALSE))","v":"NO"},{"$f":"SUMIF('I - Stationary'!$B:$B,$B31,'I - Stationary'!Z:Z)","v":0},{"$f":"SUMIF('I - Stationary'!$B:$B,$B31,'I - Stationary'!AA:AA)","v":0},{"$f":"SUMIF('I - Stationary'!$B:$B,$B31,'I - Stationary'!AB:AB)","v":0},null,null,null,null,{"$f":"SUMIF('I - Stationary'!$B:$B,$B31,'I - Stationary'!AC:AC)","v":0},{"$f":"SUMIF('I - Stationary'!$B:$B,$B31,'I - Stationary'!AD:AD)","v":0},{"$f":"IF(VLOOKUP($B31,'I - Stationary'!$B:$AG,32,FALSE)=\"\",\"\",VLOOKUP($B31,'I - Stationary'!$B:$AG,32,FALSE))","v":"I.5.2 does not occur; no agricultural activities within the city boundary"}]
[null,"I.5.3",3,"Transmission and distribution losses from grid-supplied energy consumption",{"$f":"IF(VLOOKUP(B32,'I - Stationary'!$B:$F,5,FALSE)=\"\",\"\",VLOOKUP(B32,'I - Stationary'!$B:$F,5,FALSE))","v":"NO"},{"$f":"SUMIF('I - Stationary'!$B:$B,$B32,'I - Stationary'!Z:Z)","v":0},{"$f":"SUMIF('I - Stationary'!$B:$B,$B32,'I - Stationary'!AA:AA)","v":0},{"$f":"SUMIF('I - Stationary'!$B:$B,$B32,'I - Stationary'!AB:AB)","v":0},null,null,null,null,{"$f":"SUMIF('I - Stationary'!$B:$B,$B32,'I - Stationary'!AC:AC)","v":0},{"$f":"SUMIF('I - Stationary'!$B:$B,$B32,'I - Stationary'!AD:AD)","v":0},{"$f":"IF(VLOOKUP($B32,'I - Stationary'!$B:$AG,32,FALSE)=\"\",\"\",VLOOKUP($B32,'I - Stationary'!$B:$AG,32,FALSE))","v":"I.5.3 does not occur; no agricultural activities within the city boundary"}]
[null,"I.6",null,"Non-specified sources"]
[null,"I.6.1",1,"Emissions from fuel combustion within the city boundary",{"$f":"IF(VLOOKUP(B34,'I - Stationary'!$B:$F,5,FALSE)=\"\",\"\",VLOOKUP(B34,'I - Stationary'!$B:$F,5,FALSE))","v":"NO"},{"$f":"SUMIF('I - Stationary'!$B:$B,$B34,'I - Stationary'!Z:Z)","v":0},{"$f":"SUMIF('I - Stationary'!$B:$B,$B34,'I - Stationary'!AA:AA)","v":0},{"$f":"SUMIF('I - Stationary'!$B:$B,$B34,'I - Stationary'!AB:AB)","v":0},null,null,null,null,{"$f":"SUMIF('I - Stationary'!$B:$B,$B34,'I - Stationary'!AC:AC)","v":0},{"$f":"SUMIF('I - Stationary'!$B:$B,$B34,'I - Stationary'!AD:AD)","v":0},{"$f":"IF(VLOOKUP($B34,'I - Stationary'!$B:$AG,32,FALSE)=\"\",\"\",VLOOKUP($B34,'I - Stationary'!$B:$AG,32,FALSE))","v":"I.6.1 does not occur; no non-specified sources identified within the city boundary"}]
[null,"I.6.2",2,"Emissions from grid-supplied energy consumed within the city boundary",{"$f":"IF(VLOOKUP(B35,'I - Stationary'!$B:$F,5,FALSE)=\"\",\"\",VLOOKUP(B35,'I - Stationary'!$B:$F,5,FALSE))","v":"NO"},{"$f":"SUMIF('I - Stationary'!$B:$B,$B35,'I - Stationary'!Z:Z)","v":0},{"$f":"SUMIF('I - Stationary'!$B:$B,$B35,'I - Stationary'!AA:AA)","v":0},{"$f":"SUMIF('I - Stationary'!$B:$B,$B35,'I - Stationary'!AB:AB)","v":0},null,null,null,null,{"$f":"SUMIF('I - Stationary'!$B:$B,$B35,'I - Stationary'!AC:AC)","v":0},{"$f":"SUMIF('I - Stationary'!$B:$B,$B35,'I - Stationary'!AD:AD)","v":0},{"$f":"IF(VLOOKUP($B35,'I - Stationary'!$B:$AG,32,FALSE)=\"\",\"\",VLOOKUP($B35,'I - Stationary'!$B:$AG,32,FALSE))","v":"I.6.2 does not occur; no non-specified sources identified within the city boundary"}]
[null,"I.6.3",3,"Emissions from transmission and distribution losses from grid-supplied energy consumption",{"$f":"IF(VLOOKUP(B36,'I - Stationary'!$B:$F,5,FALSE)=\"\",\"\",VLOOKUP(B36,'I - Stationary'!$B:$F,5,FALSE))","v":"NO"},{"$f":"SUMIF('I - Stationary'!$B:$B,$B36,'I - Stationary'!Z:Z)","v":0},{"$f":"SUMIF('I - Stationary'!$B:$B,$B36,'I - Stationary'!AA:AA)","v":0},{"$f":"SUMIF('I - Stationary'!$B:$B,$B36,'I - Stationary'!AB:AB)","v":0},null,null,null,null,{"$f":"SUMIF('I - Stationary'!$B:$B,$B36,'I - Stationary'!AC:AC)","v":0},{"$f":"SUMIF('I - Stationary'!$B:$B,$B36,'I - Stationary'!AD:AD)","v":0},{"$f":"IF(VLOOKUP($B36,'I - Stationary'!$B:$AG,32,FALSE)=\"\",\"\",VLOOKUP($B36,'I - Stationary'!$B:$AG,32,FALSE))","v":"I.6.3 does not occur; no non-specified sources identified within the city boundary"}]
[null,"I.7",1,"Fugitive emissions from mining, processing, storage, and transportation of coal"]
[null,"I.7.1",1,"Fugitive emissions from mining, processing, storage, and transportation of coal within the city boundary",{"$f":"IF(VLOOKUP(B38,'I - Stationary'!$B:$F,5,FALSE)=\"\",\"\",VLOOKUP(B38,'I - Stationary'!$B:$F,5,FALSE))","v":"NO"},{"$f":"SUMIF('I - Stationary'!$B:$B,$B38,'I - Stationary'!Z:Z)","v":0},{"$f":"SUMIF('I - Stationary'!$B:$B,$B38,'I - Stationary'!AA:AA)","v":0},{"$f":"SUMIF('I - Stationary'!$B:$B,$B38,'I - Stationary'!AB:AB)","v":0},null,null,null,null,{"$f":"SUMIF('I - Stationary'!$B:$B,$B38,'I - Stationary'!AC:AC)","v":0},{"$f":"SUMIF('I - Stationary'!$B:$B,$B38,'I - Stationary'!AD:AD)","v":0},{"$f":"IF(VLOOKUP($B38,'I - Stationary'!$B:$AG,32,FALSE)=\"\",\"\",VLOOKUP($B38,'I - Stationary'!$B:$AG,32,FALSE))","v":"I.7.1 does not occur; no coal-related activities within the city boundary"}]
[null,"I.8",1,"Fugitive emissions from oil and natural gas systems"]
[null,"I.8.1",1,"Fugitive emissions from oil and natural gas systems within the city boundary",{"$f":"IF(VLOOKUP(B40,'I - Stationary'!$B:$F,5,FALSE)=\"\",\"\",VLOOKUP(B40,'I - Stationary'!$B:$F,5,FALSE))","v":"NE"},{"$f":"SUMIF('I - Stationary'!$B:$B,$B40,'I - Stationary'!Z:Z)","v":0},{"$f":"SUMIF('I - Stationary'!$B:$B,$B40,'I - Stationary'!AA:AA)","v":0},{"$f":"SUMIF('I - Stationary'!$B:$B,$B40,'I - Stationary'!AB:AB)","v":0},null,null,null,null,{"$f":"SUMIF('I - Stationary'!$B:$B,$B40,'I - Stationary'!AC:AC)","v":0},{"$f":"SUMIF('I - Stationary'!$B:$B,$B40,'I - Stationary'!AD:AD)","v":0},{"$f":"IF(VLOOKUP($B40,'I - Stationary'!$B:$AG,32,FALSE)=\"\",\"\",VLOOKUP($B40,'I - Stationary'!$B:$AG,32,FALSE))","v":"I.8.1 have not been estimated"}]
[null,"II",null,"TRANSPORTATION"]
[null,"II.1",null,"On-road transportation"]
[null,"II.1.1",1,"Emissions from fuel combustion on-road transportation occurring in the city",{"$f":"IF(VLOOKUP(B43,'II - Transport'!$B:$G,6,FALSE)=\"\",\"\",VLOOKUP(B43,'II - Transport'!$B:$G,6,FALSE))","v":""},{"$f":"SUMIF('II - Transport'!$B:$B,$B43,'II - Transport'!AA:AA)","v":0},{"$f":"SUMIF('II - Transport'!$B:$B,$B43,'II - Transport'!AB:AB)","v":0},{"$f":"SUMIF('II - Transport'!$B:$B,$B43,'II - Transport'!AC:AC)","v":0},null,null,null,null,{"$f":"SUMIF('II - Transport'!$B:$B,$B43,'II - Transport'!AD:AD)","v":6783031.2123398855},{"$f":"SUMIF('II - Transport'!$B:$B,$B43,'II - Transport'!AE:AE)","v":0},{"$f":"IF(VLOOKUP($B43,'II - Transport'!$B:$AH,33,FALSE)=\"\",\"\",VLOOKUP($B43,'II - Transport'!$B:$AH,33,FALSE))","v":""}]
[null,"II.1.2",2,"Emissions from grid-supplied energy consumed in the city for on-road transportation",{"$f":"IF(VLOOKUP(B44,'II - Transport'!$B:$G,6,FALSE)=\"\",\"\",VLOOKUP(B44,'II - Transport'!$B:$G,6,FALSE))","v":"IE"},{"$f":"SUMIF('II - Transport'!$B:$B,$B44,'II - Transport'!AA:AA)","v":0},{"$f":"SUMIF('II - Transport'!$B:$B,$B44,'II - Transport'!AB:AB)","v":0},{"$f":"SUMIF('II - Transport'!$B:$B,$B44,'II - Transport'!AC:AC)","v":0},null,null,null,null,{"$f":"SUMIF('II - Transport'!$B:$B,$B44,'II - Transport'!AD:AD)","v":0},{"$f":"SUMIF('II - Transport'!$B:$B,$B44,'II - Transport'!AE:AE)","v":0},{"$f":"IF(VLOOKUP($B44,'II - Transport'!$B:$AH,33,FALSE)=\"\",\"\",VLOOKUP($B44,'II - Transport'!$B:$AH,33,FALSE))","v":"II.1.2 in included in stationary energy electricity use"}]
[null,"II.1.3",3,"Emissions from transboundary journeys occurring outside the city, and T and D losses from grid-supplied energy use",{"$f":"IF(VLOOKUP(B45,'II - Transport'!$B:$G,6,FALSE)=\"\",\"\",VLOOKUP(B45,'II - Transport'!$B:$G,6,FALSE))","v":"NE"},{"$f":"SUMIF('II - Transport'!$B:$B,$B45,'II - Transport'!AA:AA)","v":0},{"$f":"SUMIF('II - Transport'!$B:$B,$B45,'II - Transport'!AB:AB)","v":0},{"$f":"SUMIF('II - Transport'!$B:$B,$B45,'II - Transport'!AC:AC)","v":0},null,null,null,null,{"$f":"SUMIF('II - Transport'!$B:$B,$B45,'II - Transport'!AD:AD)","v":0},{"$f":"SUMIF('II - Transport'!$B:$B,$B45,'II - Transport'!AE:AE)","v":0},{"$f":"IF(VLOOKUP($B45,'II - Transport'!$B:$AH,33,FALSE)=\"\",\"\",VLOOKUP($B45,'II - Transport'!$B:$AH,33,FALSE))","v":"II.1.3 has not been estimated - optional under GPC BASIC"}]
[null,"II.2",null,"Railways"]
[null,"II.2.1",1,"Emissions from fuel combustion for railway transportation occurring in the city",{"$f":"IF(VLOOKUP(B47,'II - Transport'!$B:$G,6,FALSE)=\"\",\"\",VLOOKUP(B47,'II - Transport'!$B:$G,6,FALSE))","v":""},{"$f":"SUMIF('II - Transport'!$B:$B,$B47,'II - Transport'!AA:AA)","v":0},{"$f":"SUMIF('II - Transport'!$B:$B,$B47,'II - Transport'!AB:AB)","v":0},{"$f":"SUMIF('II - Transport'!$B:$B,$B47,'II - Transport'!AC:AC)","v":0},null,null,null,null,{"$f":"SUMIF('II - Transport'!$B:$B,$B47,'II - Transport'!AD:AD)","v":62587.199999999997},{"$f":"SUMIF('II - Transport'!$B:$B,$B47,'II - Transport'!AE:AE)","v":0},{"$f":"IF(VLOOKUP($B47,'II - Transport'!$B:$AH,33,FALSE)=\"\",\"\",VLOOKUP($B47,'II - Transport'!$B:$AH,33,FALSE))","v":""}]
[null,"II.2.2",2,"Emissions from grid-supplied energy consumed in the city for railways",{"$f":"IF(VLOOKUP(B48,'II - Transport'!$B:$G,6,FALSE)=\"\",\"\",VLOOKUP(B48,'II - Transport'!$B:$G,6,FALSE))","v":""},{"$f":"SUMIF('II - Transport'!$B:$B,$B48,'II - Transport'!AA:AA)","v":0},{"$f":"SUMIF('II - Transport'!$B:$B,$B48,'II - Transport'!AB:AB)","v":0},{"$f":"SUMIF('II - Transport'!$B:$B,$B48,'II - Transport'!AC:AC)","v":0},null,null,null,null,{"$f":"SUMIF('II - Transport'!$B:$B,$B48,'II - Transport'!AD:AD)","v":251555.59406062285},{"$f":"SUMIF('II - Transport'!$B:$B,$B48,'II - Transport'!AE:AE)","v":0},{"$f":"IF(VLOOKUP($B48,'II - Transport'!$B:$AH,33,FALSE)=\"\",\"\",VLOOKUP($B48,'II - Transport'!$B:$AH,33,FALSE))","v":""}]
[null,"II.2.3",3,"Emissions from transboundary journeys occurring outside the city, and T and D losses from grid-supplied energy use",{"$f":"IF(VLOOKUP(B49,'II - Transport'!$B:$G,6,FALSE)=\"\",\"\",VLOOKUP(B49,'II - Transport'!$B:$G,6,FALSE))","v":"NE"},{"$f":"SUMIF('II - Transport'!$B:$B,$B49,'II - Transport'!AA:AA)","v":0},{"$f":"SUMIF('II - Transport'!$B:$B,$B49,'II - Transport'!AB:AB)","v":0},{"$f":"SUMIF('II - Transport'!$B:$B,$B49,'II - Transport'!AC:AC)","v":0},null,null,null,null,{"$f":"SUMIF('II - Transport'!$B:$B,$B49,'II - Transport'!AD:AD)","v":0},{"$f":"SUMIF('II - Transport'!$B:$B,$B49,'II - Transport'!AE:AE)","v":0},{"$f":"IF(VLOOKUP($B49,'II - Transport'!$B:$AH,33,FALSE)=\"\",\"\",VLOOKUP($B49,'II - Transport'!$B:$AH,33,FALSE))","v":"II.2.3 has not been estimated - optional under GPC BASIC"}]
[null,"II.3",null,"Waterborne navigation"]
[null,"II.3.1",1,"Emissions from fuel combustion for waterborne navigation occurring in the city",{"$f":"IF(VLOOKUP(B51,'II - Transport'!$B:$G,6,FALSE)=\"\",\"\",VLOOKUP(B51,'II - Transport'!$B:$G,6,FALSE))","v":""},{"$f":"SUMIF('II - Transport'!$B:$B,$B51,'II - Transport'!AA:AA)","v":0},{"$f":"SUMIF('II - Transport'!$B:$B,$B51,'II - Transport'!AB:AB)","v":0},{"$f":"SUMIF('II - Transport'!$B:$B,$B51,'II - Transport'!AC:AC)","v":0},null,null,null,null,{"$f":"SUMIF('II - Transport'!$B:$B,$B51,'II - Transport'!AD:AD)","v":246.86441798931068},{"$f":"SUMIF('II - Transport'!$B:$B,$B51,'II - Transport'!AE:AE)","v":0},{"$f":"IF(VLOOKUP($B51,'II - Transport'!$B:$AH,33,FALSE)=\"\",\"\",VLOOKUP($B51,'II - Transport'!$B:$AH,33,FALSE))","v":""}]
[null,"II.3.2",2,"Emissions from grid-supplied energy consumed in the city for waterborne navigation",{"$f":"IF(VLOOKUP(B52,'II - Transport'!$B:$G,6,FALSE)=\"\",\"\",VLOOKUP(B52,'II - Transport'!$B:$G,6,FALSE))","v":"NO"},{"$f":"SUMIF('II - Transport'!$B:$B,$B52,'II - Transport'!AA:AA)","v":0},{"$f":"SUMIF('II - Transport'!$B:$B,$B52,'II - Transport'!AB:AB)","v":0},{"$f":"SUMIF('II - Transport'!$B:$B,$B52,'II - Transport'!AC:AC)","v":0},null,null,null,null,{"$f":"SUMIF('II - Transport'!$B:$B,$B52,'II - Transport'!AD:AD)","v":0},{"$f":"SUMIF('II - Transport'!$B:$B,$B52,'II - Transport'!AE:AE)","v":0},{"$f":"IF(VLOOKUP($B52,'II - Transport'!$B:$AH,33,FALSE)=\"\",\"\",VLOOKUP($B52,'II - Transport'!$B:$AH,33,FALSE))","v":""}]
[null,"II.3.3",3,"Emissions from transboundary journeys occurring outside the city, and T and D losses from grid-supplied energy use",{"$f":"IF(VLOOKUP(B53,'II - Transport'!$B:$G,6,FALSE)=\"\",\"\",VLOOKUP(B53,'II - Transport'!$B:$G,6,FALSE))","v":"NO"},{"$f":"SUMIF('II - Transport'!$B:$B,$B53,'II - Transport'!AA:AA)","v":0},{"$f":"SUMIF('II - Transport'!$B:$B,$B53,'II - Transport'!AB:AB)","v":0},{"$f":"SUMIF('II - Transport'!$B:$B,$B53,'II - Transport'!AC:AC)","v":0},null,null,null,null,{"$f":"SUMIF('II - Transport'!$B:$B,$B53,'II - Transport'!AD:AD)","v":0},{"$f":"SUMIF('II - Transport'!$B:$B,$B53,'II - Transport'!AE:AE)","v":0},{"$f":"IF(VLOOKUP($B53,'II - Transport'!$B:$AH,33,FALSE)=\"\",\"\",VLOOKUP($B53,'II - Transport'!$B:$AH,33,FALSE))","v":""}]
[null,"II.4",null,"Aviation"]
[null,"II.4.1",1,"Emissions from fuel combustion for aviation occurring in the city",{"$f":"IF(VLOOKUP(B55,'II - Transport'!$B:$G,6,FALSE)=\"\",\"\",VLOOKUP(B55,'II - Transport'!$B:$G,6,FALSE))","v":"NO"},{"$f":"SUMIF('II - Transport'!$B:$B,$B55,'II - Transport'!AA:AA)","v":0},{"$f":"SUMIF('II - Transport'!$B:$B,$B55,'II - Transport'!AB:AB)","v":0},{"$f":"SUMIF('II - Transport'!$B:$B,$B55,'II - Transport'!AC:AC)","v":0},null,null,null,null,{"$f":"SUMIF('II - Transport'!$B:$B,$B55,'II - Transport'!AD:AD)","v":0},{"$f":"SUMIF('II - Transport'!$B:$B,$B55,'II - Transport'!AE:AE)","v":0},{"$f":"IF(VLOOKUP($B55,'II - Transport'!$B:$AH,33,FALSE)=\"\",\"\",VLOOKUP($B55,'II - Transport'!$B:$AH,33,FALSE))","v":""}]
[null,"II.4.2",2,"Emissions from grid-supplied energy consumed in the city for aviation",{"$f":"IF(VLOOKUP(B56,'II - Transport'!$B:$G,6,FALSE)=\"\",\"\",VLOOKUP(B56,'II - Transport'!$B:$G,6,FALSE))","v":"NO"},{"$f":"SUMIF('II - Transport'!$B:$B,$B56,'II - Transport'!AA:AA)","v":0},{"$f":"SUMIF('II - Transport'!$B:$B,$B56,'II - Transport'!AB:AB)","v":0},{"$f":"SUMIF('II - Transport'!$B:$B,$B56,'II - Transport'!AC:AC)","v":0},null,null,null,null,{"$f":"SUMIF('II - Transport'!$B:$B,$B56,'II - Transport'!AD:AD)","v":0},{"$f":"SUMIF('II - Transport'!$B:$B,$B56,'II - Transport'!AE:AE)","v":0},{"$f":"IF(VLOOKUP($B56,'II - Transport'!$B:$AH,33,FALSE)=\"\",\"\",VLOOKUP($B56,'II - Transport'!$B:$AH,33,FALSE))","v":"II.4.2 does not occur"}]
[null,"II.4.3",3,"Emissions from transboundary journeys occurring outside the city, and T and D losses from grid-supplied energy use",{"$f":"IF(VLOOKUP(B57,'II - Transport'!$B:$G,6,FALSE)=\"\",\"\",VLOOKUP(B57,'II - Transport'!$B:$G,6,FALSE))","v":"NO"},{"$f":"SUMIF('II - Transport'!$B:$B,$B57,'II - Transport'!AA:AA)","v":0},{"$f":"SUMIF('II - Transport'!$B:$B,$B57,'II - Transport'!AB:AB)","v":0},{"$f":"SUMIF('II - Transport'!$B:$B,$B57,'II - Transport'!AC:AC)","v":0},null,null,null,null,{"$f":"SUMIF('II - Transport'!$B:$B,$B57,'II - Transport'!AD:AD)","v":0},{"$f":"SUMIF('II - Transport'!$B:$B,$B57,'II - Transport'!AE:AE)","v":0},{"$f":"IF(VLOOKUP($B57,'II - Transport'!$B:$AH,33,FALSE)=\"\",\"\",VLOOKUP($B57,'II - Transport'!$B:$AH,33,FALSE))","v":""}]
[null,"II.5",null,"Off-road transportation"]
[null,"II.5.1",1,"Emissions from fuel combustion for off-road transportation occurring in the city",{"$f":"IF(VLOOKUP(B59,'II - Transport'!$B:$G,6,FALSE)=\"\",\"\",VLOOKUP(B59,'II - Transport'!$B:$G,6,FALSE))","v":""},{"$f":"SUMIF('II - Transport'!$B:$B,$B59,'II - Transport'!AA:AA)","v":0},{"$f":"SUMIF('II - Transport'!$B:$B,$B59,'II - Transport'!AB:AB)","v":0},{"$f":"SUMIF('II - Transport'!$B:$B,$B59,'II - Transport'!AC:AC)","v":0},null,null,null,null,{"$f":"SUMIF('II - Transport'!$B:$B,$B59,'II - Transport'!AD:AD)","v":1011.6726599300484},{"$f":"SUMIF('II - Transport'!$B:$B,$B59,'II - Transport'!AE:AE)","v":0},{"$f":"IF(VLOOKUP($B59,'II - Transport'!$B:$AH,33,FALSE)=\"\",\"\",VLOOKUP($B59,'II - Transport'!$B:$AH,33,FALSE))","v":""}]
[null,"II.5.2",2,"Emissions from grid-supplied energy consumed in the city for off-road transportation",{"$f":"IF(VLOOKUP(B60,'II - Transport'!$B:$G,6,FALSE)=\"\",\"\",VLOOKUP(B60,'II - Transport'!$B:$G,6,FALSE))","v":"NO"},{"$f":"SUMIF('II - Transport'!$B:$B,$B60,'II - Transport'!AA:AA)","v":0},{"$f":"SUMIF('II - Transport'!$B:$B,$B60,'II - Transport'!AB:AB)","v":0},{"$f":"SUMIF('II - Transport'!$B:$B,$B60,'II - Transport'!AC:AC)","v":0},null,null,null,null,{"$f":"SUMIF('II - Transport'!$B:$B,$B60,'II - Transport'!AD:AD)","v":0},{"$f":"SUMIF('II - Transport'!$B:$B,$B60,'II - Transport'!AE:AE)","v":0},{"$f":"IF(VLOOKUP($B60,'II - Transport'!$B:$AH,33,FALSE)=\"\",\"\",VLOOKUP($B60,'II - Transport'!$B:$AH,33,FALSE))","v":""}]
[null,"II.5.3",3,"Emissions from transboundary journeys occurring outside the city, and T and D losses from grid-supplied energy use",{"$f":"IF(VLOOKUP(B61,'II - Transport'!$B:$G,6,FALSE)=\"\",\"\",VLOOKUP(B61,'II - Transport'!$B:$G,6,FALSE))","v":"NO"},{"$f":"SUMIF('II - Transport'!$B:$B,$B61,'II - Transport'!AA:AA)","v":0},{"$f":"SUMIF('II - Transport'!$B:$B,$B61,'II - Transport'!AB:AB)","v":0},{"$f":"SUMIF('II - Transport'!$B:$B,$B61,'II - Transport'!AC:AC)","v":0},null,null,null,null,{"$f":"SUMIF('II - Transport'!$B:$B,$B61,'II - Transport'!AD:AD)","v":0},{"$f":"SUMIF('II - Transport'!$B:$B,$B61,'II - Transport'!AE:AE)","v":0},{"$f":"IF(VLOOKUP($B61,'II - Transport'!$B:$AH,33,FALSE)=\"\",\"\",VLOOKUP($B61,'II - Transport'!$B:$AH,33,FALSE))","v":"II.5.3 does not occur"}]
[null,"III",null,"WASTE "]
[null,"III.1",null,"Solid waste disposal"]
[null,"III.1.1",1,"Emissions from solid waste generated in the city and disposed in landfills or open dumps within the city  ",{"$f":"IF(VLOOKUP(B64,'III - Waste'!$B:$G,6,FALSE)=\"\",\"\",VLOOKUP(B64,'III - Waste'!$B:$G,6,FALSE))","v":""},{"$f":"SUMIF('III - Waste'!$B:$B,$B64,'III - Waste'!AA:AA)","v":0},{"$f":"SUMIF('III - Waste'!$B:$B,$B64,'III - Waste'!AB:AB)","v":1291449.0378922205},{"$f":"SUMIF('III - Waste'!$B:$B,$B64,'III - Waste'!AC:AC)","v":0},null,null,null,null,{"$f":"SUMIF('III - Waste'!$B:$B,$B64,'III - Waste'!AD:AD)","v":1291449.0378922205},{"$f":"SUMIF('III - Waste'!$B:$B,$B64,'III - Waste'!AE:AE)","v":0},{"$f":"IF(VLOOKUP($B64,'III - Waste'!$B:$AH,33,FALSE)=\"\",\"\",VLOOKUP($B64,'III - Waste'!$B:$AH,33,FALSE))","v":""}]
[null,"III.1.2",3,"Emissions from solid waste generated in the city but disposed in landfills or open dumps outside the city  ",{"$f":"IF(VLOOKUP(B65,'III - Waste'!$B:$G,6,FALSE)=\"\",\"\",VLOOKUP(B65,'III - Waste'!$B:$G,6,FALSE))","v":"NO"},{"$f":"SUMIF('III - Waste'!$B:$B,$B65,'III - Waste'!AA:AA)","v":0},{"$f":"SUMIF('III - Waste'!$B:$B,$B65,'III - Waste'!AB:AB)","v":0},{"$f":"SUMIF('III - Waste'!$B:$B,$B65,'III - Waste'!AC:AC)","v":0},null,null,null,null,{"$f":"SUMIF('III - Waste'!$B:$B,$B65,'III - Waste'!AD:AD)","v":0},{"$f":"SUMIF('III - Waste'!$B:$B,$B65,'III - Waste'!AE:AE)","v":0},{"$f":"IF(VLOOKUP($B65,'III - Waste'!$B:$AH,33,FALSE)=\"\",\"\",VLOOKUP($B65,'III - Waste'!$B:$AH,33,FALSE))","v":""}]
[null,"III.1.3",1,"Emissions from waste generated outside the city and disposed in landfills or open dumps within the city  ",{"$f":"IF(VLOOKUP(B66,'III - Waste'!$B:$G,6,FALSE)=\"\",\"\",VLOOKUP(B66,'III - Waste'!$B:$G,6,FALSE))","v":"NO"},{"$f":"SUMIF('III - Waste'!$B:$B,$B66,'III - Waste'!AA:AA)","v":0},{"$f":"SUMIF('III - Waste'!$B:$B,$B66,'III - Waste'!AB:AB)","v":0},{"$f":"SUMIF('III - Waste'!$B:$B,$B66,'III - Waste'!AC:AC)","v":0},null,null,null,null,{"$f":"SUMIF('III - Waste'!$B:$B,$B66,'III - Waste'!AD:AD)","v":0},{"$f":"SUMIF('III - Waste'!$B:$B,$B66,'III - Waste'!AE:AE)","v":0},{"$f":"IF(VLOOKUP($B66,'III - Waste'!$B:$AH,33,FALSE)=\"\",\"\",VLOOKUP($B66,'III - Waste'!$B:$AH,33,FALSE))","v":""}]
[null,"III.2",null,"Biological treatment of waste"]
[null,"III.2.1",1,"Emissions from solid waste generated in the city that is treated biologically in the city",{"$f":"IF(VLOOKUP(B68,'III - Waste'!$B:$G,6,FALSE)=\"\",\"\",VLOOKUP(B68,'III - Waste'!$B:$G,6,FALSE))","v":"NO"},{"$f":"SUMIF('III - Waste'!$B:$B,$B68,'III - Waste'!AA:AA)","v":0},{"$f":"SUMIF('III - Waste'!$B:$B,$B68,'III - Waste'!AB:AB)","v":0},{"$f":"SUMIF('III - Waste'!$B:$B,$B68,'III - Waste'!AC:AC)","v":0},null,null,null,null,{"$f":"SUMIF('III - Waste'!$B:$B,$B68,'III - Waste'!AD:AD)","v":0},{"$f":"SUMIF('III - Waste'!$B:$B,$B68,'III - Waste'!AE:AE)","v":0},{"$f":"IF(VLOOKUP($B68,'III - Waste'!$B:$AH,33,FALSE)=\"\",\"\",VLOOKUP($B68,'III - Waste'!$B:$AH,33,FALSE))","v":""}]
[null,"III.2.2",3,"Emissions from solid waste generated in the city but treated biologically outside of the city ",{"$f":"IF(VLOOKUP(B69,'III - Waste'!$B:$G,6,FALSE)=\"\",\"\",VLOOKUP(B69,'III - Waste'!$B:$G,6,FALSE))","v":"NO"},{"$f":"SUMIF('III - Waste'!$B:$B,$B69,'III - Waste'!AA:AA)","v":0},{"$f":"SUMIF('III - Waste'!$B:$B,$B69,'III - Waste'!AB:AB)","v":0},{"$f":"SUMIF('III - Waste'!$B:$B,$B69,'III - Waste'!AC:AC)","v":0},null,null,null,null,{"$f":"SUMIF('III - Waste'!$B:$B,$B69,'III - Waste'!AD:AD)","v":0},{"$f":"SUMIF('III - Waste'!$B:$B,$B69,'III - Waste'!AE:AE)","v":0},{"$f":"IF(VLOOKUP($B69,'III - Waste'!$B:$AH,33,FALSE)=\"\",\"\",VLOOKUP($B69,'III - Waste'!$B:$AH,33,FALSE))","v":""}]
[null,"III.2.3",1,"Emissions from waste generated outside the city boundary but treated in the city",{"$f":"IF(VLOOKUP(B70,'III - Waste'!$B:$G,6,FALSE)=\"\",\"\",VLOOKUP(B70,'III - Waste'!$B:$G,6,FALSE))","v":"NO"},{"$f":"SUMIF('III - Waste'!$B:$B,$B70,'III - Waste'!AA:AA)","v":0},{"$f":"SUMIF('III - Waste'!$B:$B,$B70,'III - Waste'!AB:AB)","v":0},{"$f":"SUMIF('III - Waste'!$B:$B,$B70,'III - Waste'!AC:AC)","v":0},null,null,null,null,{"$f":"SUMIF('III - Waste'!$B:$B,$B70,'III - Waste'!AD:AD)","v":0},{"$f":"SUMIF('III - Waste'!$B:$B,$B70,'III - Waste'!AE:AE)","v":0},{"$f":"IF(VLOOKUP($B70,'III - Waste'!$B:$AH,33,FALSE)=\"\",\"\",VLOOKUP($B70,'III - Waste'!$B:$AH,33,FALSE))","v":""}]
[null,"III.3",null,"Incineration and open burning"]
[null,"III.3.1",1,"Emissions from waste generated and treated within the city  ",{"$f":"IF(VLOOKUP(B72,'III - Waste'!$B:$G,6,FALSE)=\"\",\"\",VLOOKUP(B72,'III - Waste'!$B:$G,6,FALSE))","v":"NO"},{"$f":"SUMIF('III - Waste'!$B:$B,$B72,'III - Waste'!AA:AA)","v":0},{"$f":"SUMIF('III - Waste'!$B:$B,$B72,'III - Waste'!AB:AB)","v":0},{"$f":"SUMIF('III - Waste'!$B:$B,$B72,'III - Waste'!AC:AC)","v":0},null,null,null,null,{"$f":"SUMIF('III - Waste'!$B:$B,$B72,'III - Waste'!AD:AD)","v":0},{"$f":"SUMIF('III - Waste'!$B:$B,$B72,'III - Waste'!AE:AE)","v":0},{"$f":"IF(VLOOKUP($B72,'III - Waste'!$B:$AH,33,FALSE)=\"\",\"\",VLOOKUP($B72,'III - Waste'!$B:$AH,33,FALSE))","v":""}]
[null,"III.3.2",3,"Emissions from waste generated within but treated outside of the city ",{"$f":"IF(VLOOKUP(B73,'III - Waste'!$B:$G,6,FALSE)=\"\",\"\",VLOOKUP(B73,'III - Waste'!$B:$G,6,FALSE))","v":"NO"},{"$f":"SUMIF('III - Waste'!$B:$B,$B73,'III - Waste'!AA:AA)","v":0},{"$f":"SUMIF('III - Waste'!$B:$B,$B73,'III - Waste'!AB:AB)","v":0},{"$f":"SUMIF('III - Waste'!$B:$B,$B73,'III - Waste'!AC:AC)","v":0},null,null,null,null,{"$f":"SUMIF('III - Waste'!$B:$B,$B73,'III - Waste'!AD:AD)","v":0},{"$f":"SUMIF('III - Waste'!$B:$B,$B73,'III - Waste'!AE:AE)","v":0},{"$f":"IF(VLOOKUP($B73,'III - Waste'!$B:$AH,33,FALSE)=\"\",\"\",VLOOKUP($B73,'III - Waste'!$B:$AH,33,FALSE))","v":""}]
[null,"III.3.3",1,"Emissions from waste generated outside the city boundary but treated within the city",{"$f":"IF(VLOOKUP(B74,'III - Waste'!$B:$G,6,FALSE)=\"\",\"\",VLOOKUP(B74,'III - Waste'!$B:$G,6,FALSE))","v":"NO"},{"$f":"SUMIF('III - Waste'!$B:$B,$B74,'III - Waste'!AA:AA)","v":0},{"$f":"SUMIF('III - Waste'!$B:$B,$B74,'III - Waste'!AB:AB)","v":0},{"$f":"SUMIF('III - Waste'!$B:$B,$B74,'III - Waste'!AC:AC)","v":0},null,null,null,null,{"$f":"SUMIF('III - Waste'!$B:$B,$B74,'III - Waste'!AD:AD)","v":0},{"$f":"SUMIF('III - Waste'!$B:$B,$B74,'III - Waste'!AE:AE)","v":0},{"$f":"IF(VLOOKUP($B74,'III - Waste'!$B:$AH,33,FALSE)=\"\",\"\",VLOOKUP($B74,'III - Waste'!$B:$AH,33,FALSE))","v":""}]
[null,"III.4",null,"Wastewater treatment and discharge"]
[null,"III.4.1",1,"Emissions from wastewater generated and treated within the city  ",{"$f":"IF(VLOOKUP(B76,'III - Waste'!$B:$G,6,FALSE)=\"\",\"\",VLOOKUP(B76,'III - Waste'!$B:$G,6,FALSE))","v":""},{"$f":"SUMIF('III - Waste'!$B:$B,$B76,'III - Waste'!AA:AA)","v":0},{"$f":"SUMIF('III - Waste'!$B:$B,$B76,'III - Waste'!AB:AB)","v":2341.5010102881142},{"$f":"SUMIF('III - Waste'!$B:$B,$B76,'III - Waste'!AC:AC)","v":32872.191558119644},null,null,null,null,{"$f":"SUMIF('III - Waste'!$B:$B,$B76,'III - Waste'!AD:AD)","v":35213.692568407758},{"$f":"SUMIF('III - Waste'!$B:$B,$B76,'III - Waste'!AE:AE)","v":0},{"$f":"IF(VLOOKUP($B76,'III - Waste'!$B:$AH,33,FALSE)=\"\",\"\",VLOOKUP($B76,'III - Waste'!$B:$AH,33,FALSE))","v":""}]
[null,"III.4.2",3,"Emissions from wastewater generated within but treated outside of the city ",{"$f":"IF(VLOOKUP(B77,'III - Waste'!$B:$G,6,FALSE)=\"\",\"\",VLOOKUP(B77,'III - Waste'!$B:$G,6,FALSE))","v":"NO"},{"$f":"SUMIF('III - Waste'!$B:$B,$B77,'III - Waste'!AA:AA)","v":0},{"$f":"SUMIF('III - Waste'!$B:$B,$B77,'III - Waste'!AB:AB)","v":0},{"$f":"SUMIF('III - Waste'!$B:$B,$B77,'III - Waste'!AC:AC)","v":0},null,null,null,null,{"$f":"SUMIF('III - Waste'!$B:$B,$B77,'III - Waste'!AD:AD)","v":0},{"$f":"SUMIF('III - Waste'!$B:$B,$B77,'III - Waste'!AE:AE)","v":0},{"$f":"IF(VLOOKUP($B77,'III - Waste'!$B:$AH,33,FALSE)=\"\",\"\",VLOOKUP($B77,'III - Waste'!$B:$AH,33,FALSE))","v":""}]
[null,"III.4.3",1,"Emissions from wastewater generated outside the city boundary but treated within the city",{"$f":"IF(VLOOKUP(B78,'III - Waste'!$B:$G,6,FALSE)=\"\",\"\",VLOOKUP(B78,'III - Waste'!$B:$G,6,FALSE))","v":"NO"},{"$f":"SUMIF('III - Waste'!$B:$B,$B78,'III - Waste'!AA:AA)","v":0},{"$f":"SUMIF('III - Waste'!$B:$B,$B78,'III - Waste'!AB:AB)","v":0},{"$f":"SUMIF('III - Waste'!$B:$B,$B78,'III - Waste'!AC:AC)","v":0},null,null,null,null,{"$f":"SUMIF('III - Waste'!$B:$B,$B78,'III - Waste'!AD:AD)","v":0},{"$f":"SUMIF('III - Waste'!$B:$B,$B78,'III - Waste'!AE:AE)","v":0},{"$f":"IF(VLOOKUP($B78,'III - Waste'!$B:$AH,33,FALSE)=\"\",\"\",VLOOKUP($B78,'III - Waste'!$B:$AH,33,FALSE))","v":""}]
[null,"IV",1,"INDUSTRIAL PROCESSES and PRODUCT USES (IPPU)"]
[null,"IV.1",1,"Emissions from industrial processes occurring in the city boundary",{"$f":"IF(VLOOKUP(B80,'IV - IPPU'!$B:$F,5,FALSE)=\"\",\"\",VLOOKUP(B80,'IV - IPPU'!$B:$F,5,FALSE))","v":""},{"$f":"SUMIF('IV - IPPU'!$B:$B,$B80,'IV - IPPU'!AT:AT)","v":0},{"$f":"SUMIF('IV - IPPU'!$B:$B,$B80,'IV - IPPU'!AU:AU)","v":0},{"$f":"SUMIF('IV - IPPU'!$B:$B,$B80,'IV - IPPU'!AV:AV)","v":0},{"$f":"SUMIF('IV - IPPU'!$B:$B,$B80,'IV - IPPU'!AW:AW)","v":0},{"$f":"SUMIF('IV - IPPU'!$B:$B,$B80,'IV - IPPU'!AX:AX)","v":0},{"$f":"SUMIF('IV - IPPU'!$B:$B,$B80,'IV - IPPU'!AY:AY)","v":0},{"$f":"SUMIF('IV - IPPU'!$B:$B,$B80,'IV - IPPU'!AZ:AZ)","v":0},{"$f":"SUMIF('IV - IPPU'!$B:$B,$B80,'IV - IPPU'!BA:BA)","v":53738},{"$f":"SUMIF('IV - IPPU'!$B:$B,$B80,'IV - IPPU'!BB:BB)","v":0},{"$f":"IF(VLOOKUP($B80,'IV - IPPU'!$B:$BE,56,FALSE)=\"\",\"\",VLOOKUP($B80,'IV - IPPU'!$B:$BE,56,FALSE))","v":"IV.1 has not been estimated; activity not required for BASIC"}]
[null,"IV.2",1,"Emissions from product use occurring within the city boundary",{"$f":"IF(VLOOKUP(B81,'IV - IPPU'!$B:$F,5,FALSE)=\"\",\"\",VLOOKUP(B81,'IV - IPPU'!$B:$F,5,FALSE))","v":""},{"$f":"SUMIF('IV - IPPU'!$B:$B,$B81,'IV - IPPU'!AT:AT)","v":0},{"$f":"SUMIF('IV - IPPU'!$B:$B,$B81,'IV - IPPU'!AU:AU)","v":0},{"$f":"SUMIF('IV - IPPU'!$B:$B,$B81,'IV - IPPU'!AV:AV)","v":0},{"$f":"SUMIF('IV - IPPU'!$B:$B,$B81,'IV - IPPU'!AW:AW)","v":0},{"$f":"SUMIF('IV - IPPU'!$B:$B,$B81,'IV - IPPU'!AX:AX)","v":0},{"$f":"SUMIF('IV - IPPU'!$B:$B,$B81,'IV - IPPU'!AY:AY)","v":0},{"$f":"SUMIF('IV - IPPU'!$B:$B,$B81,'IV - IPPU'!AZ:AZ)","v":0},{"$f":"SUMIF('IV - IPPU'!$B:$B,$B81,'IV - IPPU'!BA:BA)","v":193540.9803106488},{"$f":"SUMIF('IV - IPPU'!$B:$B,$B81,'IV - IPPU'!BB:BB)","v":0},{"$f":"IF(VLOOKUP($B81,'IV - IPPU'!$B:$BE,56,FALSE)=\"\",\"\",VLOOKUP($B81,'IV - IPPU'!$B:$BE,56,FALSE))","v":"IV.2 has not been estimated; activity not required for BASIC"}]
[null,"V",1,"AGRICULTURE, FORESTRY and OTHER LAND USE (AFOLU)"]
[null,"V.1",1,"Emissions from livestock",{"$f":"IF(VLOOKUP(B83,'V - AFOLU'!$B:$F,5,FALSE)=\"\",\"\",VLOOKUP(B83,'V - AFOLU'!$B:$F,5,FALSE))","v":"NE"},{"$f":"SUMIF('V - AFOLU'!$B:$B,$B83,'V - AFOLU'!Z:Z)","v":0},{"$f":"SUMIF('V - AFOLU'!$B:$B,$B83,'V - AFOLU'!AA:AA)","v":0},{"$f":"SUMIF('V - AFOLU'!$B:$B,$B83,'V - AFOLU'!AB:AB)","v":0},null,null,null,null,{"$f":"SUMIF('V - AFOLU'!$B:$B,$B83,'V - AFOLU'!AC:AC)","v":0},{"$f":"SUMIF('V - AFOLU'!$B:$B,$B83,'V - AFOLU'!AD:AD)","v":0},{"$f":"IF(VLOOKUP($B83,'V - AFOLU'!$B:$AG,32,FALSE)=\"\",\"\",VLOOKUP($B83,'V - AFOLU'!$B:$AG,32,FALSE))","v":"V.1 has not been estimated; activity not required for BASIC"}]
[null,"V.2",1,"Emissions from land",{"$f":"IF(VLOOKUP(B84,'V - AFOLU'!$B:$F,5,FALSE)=\"\",\"\",VLOOKUP(B84,'V - AFOLU'!$B:$F,5,FALSE))","v":"NE"},{"$f":"SUMIF('V - AFOLU'!$B:$B,$B84,'V - AFOLU'!Z:Z)","v":0},{"$f":"SUMIF('V - AFOLU'!$B:$B,$B84,'V - AFOLU'!AA:AA)","v":0},{"$f":"SUMIF('V - AFOLU'!$B:$B,$B84,'V - AFOLU'!AB:AB)","v":0},null,null,null,null,{"$f":"SUMIF('V - AFOLU'!$B:$B,$B84,'V - AFOLU'!AC:AC)","v":0},{"$f":"SUMIF('V - AFOLU'!$B:$B,$B84,'V - AFOLU'!AD:AD)","v":0},{"$f":"IF(VLOOKUP($B84,'V - AFOLU'!$B:$AG,32,FALSE)=\"\",\"\",VLOOKUP($B84,'V - AFOLU'!$B:$AG,32,FALSE))","v":"V.2 has not been estimated; activity not required for BASIC"}]
[null,"V.3",1,"Emissions from aggregate sources and non-CO2 emission sources on land",{"$f":"IF(VLOOKUP(B85,'V - AFOLU'!$B:$F,5,FALSE)=\"\",\"\",VLOOKUP(B85,'V - AFOLU'!$B:$F,5,FALSE))","v":"NE"},{"$f":"SUMIF('V - AFOLU'!$B:$B,$B85,'V - AFOLU'!Z:Z)","v":0},{"$f":"SUMIF('V - AFOLU'!$B:$B,$B85,'V - AFOLU'!AA:AA)","v":0},{"$f":"SUMIF('V - AFOLU'!$B:$B,$B85,'V - AFOLU'!AB:AB)","v":0},null,null,null,null,{"$f":"SUMIF('V - AFOLU'!$B:$B,$B85,'V - AFOLU'!AC:AC)","v":0},{"$f":"SUMIF('V - AFOLU'!$B:$B,$B85,'V - AFOLU'!AD:AD)","v":0},{"$f":"IF(VLOOKUP($B85,'V - AFOLU'!$B:$AG,32,FALSE)=\"\",\"\",VLOOKUP($B85,'V - AFOLU'!$B:$AG,32,FALSE))","v":"V.3 has not been estimated; activity not required for BASIC"}]
[null,"VI",3,"OTHER SCOPE 3"]
[null,"VI.1",3,"Other Scope 3",{"$f":"IF(VLOOKUP(B87,'VI - Other scope 3'!$B:$F,5,FALSE)=\"\",\"\",VLOOKUP(B87,'VI - Other scope 3'!$B:$F,5,FALSE))","v":"NE"},{"$f":"SUMIF('VI - Other scope 3'!$B:$B,$B87,'VI - Other scope 3'!AT:AT)","v":0},{"$f":"SUMIF('VI - Other scope 3'!$B:$B,$B87,'VI - Other scope 3'!AU:AU)","v":0},{"$f":"SUMIF('VI - Other scope 3'!$B:$B,$B87,'VI - Other scope 3'!AV:AV)","v":0},{"$f":"SUMIF('VI - Other scope 3'!$B:$B,$B87,'VI - Other scope 3'!AW:AW)","v":0},{"$f":"SUMIF('VI - Other scope 3'!$B:$B,$B87,'VI - Other scope 3'!AX:AX)","v":0},{"$f":"SUMIF('VI - Other scope 3'!$B:$B,$B87,'VI - Other scope 3'!AY:AY)","v":0},{"$f":"SUMIF('VI - Other scope 3'!$B:$B,$B87,'VI - Other scope 3'!AZ:AZ)","v":0},{"$f":"SUMIF('VI - Other scope 3'!$B:$B,$B87,'VI - Other scope 3'!BA:BA)","v":0},{"$f":"SUMIF('VI - Other scope 3'!$B:$B,$B87,'VI - Other scope 3'!BB:BB)","v":0},{"$f":"IF(VLOOKUP($B87,'VI - Other scope 3'!$B:$BE,56,FALSE)=\"\",\"\",VLOOKUP($B87,'VI - Other scope 3'!$B:$BE,56,FALSE))","v":"VI.1 has not been estimated; activity not required for BASIC"}]

{"sheet":"Graphs","index":12,"n_rows":0,"n_cols":0,"rows_kept":0,"cut":false,"hidden":true,"merged":[]}

{"sheet":"Table B. Summary","index":13,"n_rows":109,"n_cols":19,"rows_kept":109,"cut":false,"hidden":false,"merged":[[3,13,4,13],[19,6,19,9],[7,1,8,3],[9,1,10,2],[11,1,11,2],[12,1,13,2],[14,1,14,2],[7,4,7,9],[7,10,7,12],[53,2,53,3],[58,2,58,3],[15,1,15,2],[16,1,16,2],[17,1,17,3],[19,1,20,1],[19,2,20,5],[31,2,31,5],[21,2,21,3],[32,2,32,3],[39,2,39,3],[49,2,49,3],[65,1,65,9],[66,1,66,9],[79,1,79,9],[102,2,102,9],[104,1,104,9]]}
[]
[null,"GPC GHG Summary Tables",null,null,null,null,null,null,null,{"$f":"(IFERROR(IF('City information'!C25=\"BASIC\",\"BASIC \",IF('City information'!C25=\"BASIC+\",\"BASIC+ \",\"\")),\"\"))","v":"BASIC "},null,null,null,""]
[]
[null,"NAME OF CITY:",null,{"$f":"IF('City information'!C10=\"\",'City information'!C9,CONCATENATE('City information'!C9,\", \",'City information'!C10))","v":"Chicago, USA"},null,null,null,"POPULATION:",null,{"$f":"'City information'!C14","v":2695598},null,null,null,"Net emissions"]
[null,"BOUNDARY:",null,{"$f":"'City information'!C12","v":"Administrative boundary of a local government "},null,null,null,"LAND AREA (km2):",null,{"$f":"'City information'!C13","v":0}]
[null,"INVENTORY YEAR:",null,{"$f":"'City information'!C11","v":2010},null,null,null,"GDP (US$ bn):",null,{"$f":"'City information'!C15/1000000000","v":0}]
[]
[null,"GHG Emissions Source (By Sector)",null,null,"Total GHGs (metric tonnes CO2e)",null,null,null,null,null,"Net GHGs (mtCO2e)"]
[null,null,null,null,"Scope 1","Scope 2","Scope 3","BASIC","BASIC+","BASIC+ S3","BASIC","BASIC+","BASIC+ S3"]
[null,"STATIONARY ENERGY",null,"Energy use (all emissions except I.4.4)",{"$f":"G32","v":10063097.609152079},{"$f":"H32","v":14810105.254146341},{"$f":"I32","v":0},{"$f":"E10+F10","v":24873202.86329842},{"$f":"SUM(E10:G10)","v":24873202.86329842},{"$f":"SUM(E10:G10)","v":24873202.86329842},{"$f":"H10-'City information'!G59+'City information'!C70-'City information'!C79-'City information'!K90","v":24873202.86329842},{"$f":"I10-'City information'!G59+'City information'!C70-'City information'!C79-'City information'!K90","v":24873202.86329842},{"$f":"J10-'City information'!G59+'City information'!C70-'City information'!C79-'City information'!K90","v":24873202.86329842}]
[null,null,null,"Energy generation supplied to the grid (I.4.4)",{"$f":"IF('Table A. Overview'!E28=\"\",'Table A. Overview'!M28,\"\")","v":""}]
[null,"TRANSPORTATION",null,"(all II emissions)",{"$f":"G39","v":6846876.9494178053},{"$f":"H39","v":251555.59406062285},{"$f":"I39","v":0},{"$f":"E12+F12","v":7098432.5434784284},{"$f":"SUM(E12:G12)","v":7098432.5434784284},{"$f":"SUM(E12:G12)","v":7098432.5434784284},{"$f":"H12","v":7098432.5434784284},7098432.5434784284,7098432.5434784284]
[null,"WASTE",null,"Waste generated in the city (III.X.1 and III.X.2)",{"$f":"G49","v":1326662.7304606284},null,{"$f":"I49","v":0},{"$f":"E13+G13","v":1326662.7304606284},{"$f":"E13+G13","v":1326662.7304606284},{"$f":"E13+G13","v":1326662.7304606284},1326662.7304606284,1326662.7304606284,1326662.7304606284]
[null,null,null,"Waste generated outside city (III.X.3)",{"$f":"SUM(G45:G48)","v":0}]
[null,"IPPU",null,"(all IV emissions)",{"$f":"G53","v":247278.9803106488},null,null,null,{"$f":"E15","v":247278.9803106488},{"$f":"E15","v":247278.9803106488},null,{"$f":"I15","v":247278.9803106488},{"$f":"J15","v":247278.9803106488}]
[null,"AFOLU ",null,"(all V emissions)",{"$f":"G58","v":0},null,null,null,{"$f":"E16","v":0},{"$f":"E16","v":0},null,{"$f":"I16","v":0},{"$f":"J16","v":0}]
[null,"OTHER SCOPE 3",null,"(all VI emissions)",null,null,{"$f":"IF(ISNUMBER(I60),I60,\"\")","v":""},null,null,{"$f":"SUM(G17)","v":0},null,null,{"$f":"J17","v":0}]
[null,"TOTAL",null,null,{"$f":"IF(SUM(E10:E16)=0,\"All territorial emissions\",SUM(E10:E16))","v":18483916.269341163},{"$f":"IF((F10+F12)=0,\"\",F10+F12)","v":15061660.848206963},{"$f":"IF((G10+G12+G13)=0,\"\",(G10+G12+G13))","v":""},{"$f":"IF((H10+H12+H13)=0,\"All BASIC emissions\",(H10+H12+H13))","v":33298298.137237478},{"$f":"IF((I10+I12+I13+I15+I16)=0,\"All BASIC+ emissions\",(I10+I12+I13+I15+I16))","v":33545577.117548127},{"$f":"IF((J10+J12+J13+J15+J16+J17)=0,\"All BASIC+ S3 emissions\",(J10+J12+J13+J15+J16+J17))","v":33545577.117548127},{"$f":"IF((K10+K12+K13+K11)=0,\"NET BASIC emissions\",(K10+K12+K13+K11))","v":33298298.137237478},{"$f":"IF((L10+L12+L13+L15+L16+L11)=0,\"NET BASIC+ emissions\",(L10+L12+L13+L15+L16+L11))","v":33545577.117548127},{"$f":"IF((M10+M12+M13+M15+M16+M17)=0,\"Net BASIC+ S3 emissions\",(M10+M12+M13+M15+M16+M17))","v":33545577.117548127}]
[]
[null,"GPC ref No.","GHG Emissions Source (By Sector and Sub-sector)",null,null,null,"Total GHGs (metric tonnes CO2e)"]
[null,null,null,null,null,null,"Scope 1","Scope 2","Scope 3","Total"]
[null,"I","STATIONARY ENERGY "]
[null,"I.1","Residential buildings",null,null,null,{"$f":"IF('Table A. Overview'!E13=\"\",'Table A. Overview'!M13,'Table A. Overview'!E13)","v":5715207.9086837154},{"$f":"IF('Table A. Overview'!E14=\"\",'Table A. Overview'!M14,'Table A. Overview'!E14)","v":4062733.7041084813},{"$f":"IF('Table A. Overview'!E15=\"\",'Table A. Overview'!M15,'Table A. Overview'!E15)","v":"NE"},{"$f":"SUM(G23:I23)","v":9777941.6127921976}]
[null,"I.2","Commercial and institutional buildings and facilities",null,null,null,{"$f":"IF('Table A. Overview'!E17=\"\",'Table A. Overview'!M17,'Table A. Overview'!E17)","v":2996949.1307490799},{"$f":"IF('Table A. Overview'!E18=\"\",'Table A. Overview'!M18,'Table A. Overview'!E18)","v":10747371.550037861},{"$f":"IF('Table A. Overview'!E19=\"\",'Table A. Overview'!M19,'Table A. Overview'!E19)","v":"NE"},13744320.680786941]
[null,"I.3","Manufacturing industries and construction",null,null,null,{"$f":"IF('Table A. Overview'!E21=\"\",'Table A. Overview'!M21,'Table A. Overview'!E21)","v":1350940.5697192827},{"$f":"IF('Table A. Overview'!E22=\"\",'Table A. Overview'!M22,'Table A. Overview'!E22)","v":"IE"},{"$f":"IF('Table A. Overview'!E23=\"\",'Table A. Overview'!M23,'Table A. Overview'!E23)","v":"NE"},1350940.5697192827]
[null,"I.4.1/2/3","Energy industries",null,null,null,{"$f":"IF('Table A. Overview'!E25=\"\",'Table A. Overview'!M25,'Table A. Overview'!E25)","v":"NO"},{"$f":"IF('Table A. Overview'!E26=\"\",'Table A. Overview'!M26,'Table A. Overview'!E26)","v":"NO"},{"$f":"IF('Table A. Overview'!E27=\"\",'Table A. Overview'!M27,'Table A. Overview'!E27)","v":"NO"},0]
[null,"I.4.4","Energy generation supplied to the grid",null,null,null,{"$f":"IF('Table A. Overview'!E28=\"\",'Table A. Overview'!M28,'Table A. Overview'!E28)","v":"NO"}]
[null,"I.5","Agriculture, forestry and fishing activities",null,null,null,{"$f":"IF('Table A. Overview'!E30=\"\",'Table A. Overview'!M30,'Table A. Overview'!E30)","v":"NO"},{"$f":"IF('Table A. Overview'!E31=\"\",'Table A. Overview'!M31,'Table A. Overview'!E31)","v":"NO"},{"$f":"IF('Table A. Overview'!E32=\"\",'Table A. Overview'!M32,'Table A. Overview'!E32)","v":"NO"},0]
[null,"I.6","Non-specified sources",null,null,null,{"$f":"IF('Table A. Overview'!E34=\"\",'Table A. Overview'!M34,'Table A. Overview'!E34)","v":"NO"},{"$f":"IF('Table A. Overview'!E35=\"\",'Table A. Overview'!M35,'Table A. Overview'!E35)","v":"NO"},{"$f":"IF('Table A. Overview'!E36=\"\",'Table A. Overview'!M36,'Table A. Overview'!E36)","v":"NO"},0]
[null,"I.7","Fugitive emissions from mining, processing, storage, and transportation of coal",null,null,null,{"$f":"IF('Table A. Overview'!E38=\"\",'Table A. Overview'!M38,'Table A. Overview'!E38)","v":"NO"},null,null,{"$f":"SUM(G30:I30)","v":0}]
[null,"I.8","Fugitive emissions from oil and natural gas systems",null,null,null,{"$f":"IF('Table A. Overview'!E40=\"\",'Table A. Overview'!M40,'Table A. Overview'!E40)","v":"NE"},null,null,{"$f":"SUM(G31:I31)","v":0}]
[null,"SUB-TOTAL","(city induced framework only)",null,null,null,{"$f":"SUM(G23:G26)+SUM(G28:G31)","v":10063097.609152079},{"$f":"SUM(H23:H31)","v":14810105.254146341},{"$f":"SUM(I23:I31)","v":0},{"$f":"SUM(J23:J26)+SUM(J28:J31)","v":24873202.86329842}]
[null,"II","TRANSPORTATION"]
[null,"II.1","On-road transportation",null,null,null,{"$f":"IF('Table A. Overview'!E43=\"\",'Table A. Overview'!M43,'Table A. Overview'!E43)","v":6783031.2123398855},{"$f":"IF('Table A. Overview'!E44=\"\",'Table A. Overview'!M44,'Table A. Overview'!E44)","v":"IE"},{"$f":"IF('Table A. Overview'!E45=\"\",'Table A. Overview'!M45,'Table A. Overview'!E45)","v":"NE"},{"$f":"SUM(G34:I34)","v":6783031.2123398855}]
[null,"II.2","Railways",null,null,null,{"$f":"IF('Table A. Overview'!E47=\"\",'Table A. Overview'!M47,'Table A. Overview'!E47)","v":62587.199999999997},{"$f":"IF('Table A. Overview'!E48=\"\",'Table A. Overview'!M48,'Table A. Overview'!E48)","v":251555.59406062285},{"$f":"IF('Table A. Overview'!E49=\"\",'Table A. Overview'!M49,'Table A. Overview'!E49)","v":"NE"},{"$f":"SUM(G35:I35)","v":314142.79406062287}]
[null,"II.3","Waterborne navigation",null,null,null,{"$f":"IF('Table A. Overview'!E51=\"\",'Table A. Overview'!M51,'Table A. Overview'!E51)","v":246.86441798931068},{"$f":"IF('Table A. Overview'!E52=\"\",'Table A. Overview'!M52,'Table A. Overview'!E52)","v":"NO"},{"$f":"IF('Table A. Overview'!E53=\"\",'Table A. Overview'!M53,'Table A. Overview'!E53)","v":"NO"},{"$f":"SUM(G36:I36)","v":246.86441798931068}]
[null,"II.4","Aviation",null,null,null,{"$f":"IF('Table A. Overview'!E55=\"\",'Table A. Overview'!M55,'Table A. Overview'!E55)","v":"NO"},{"$f":"IF('Table A. Overview'!E56=\"\",'Table A. Overview'!M56,'Table A. Overview'!E56)","v":"NO"},{"$f":"IF('Table A. Overview'!E57=\"\",'Table A. Overview'!M57,'Table A. Overview'!E57)","v":"NO"},{"$f":"SUM(G37:I37)","v":0}]
[null,"II.5","Off-road transportation",null,null,null,{"$f":"IF('Table A. Overview'!E59=\"\",'Table A. Overview'!M59,'Table A. Overview'!E59)","v":1011.6726599300484},{"$f":"IF('Table A. Overview'!E60=\"\",'Table A. Overview'!M60,'Table A. Overview'!E60)","v":"NO"},{"$f":"IF('Table A. Overview'!E61=\"\",'Table A. Overview'!M61,'Table A. Overview'!E61)","v":"NO"},{"$f":"SUM(G38:I38)","v":1011.6726599300484}]
[null,"SUB-TOTAL","(city induced framework only)",null,null,null,{"$f":"SUM(G34:G38)","v":6846876.9494178053},{"$f":"SUM(H34:H38)","v":251555.59406062285},{"$f":"SUM(I34:I38)","v":0},{"$f":"SUM(J34:J38)","v":7098432.5434784284}]
[null,"III","WASTE "]
[null,"III.1.1/2","Solid waste generated in the city",null,null,null,{"$f":"IF('Table A. Overview'!E64=\"\",'Table A. Overview'!M64,'Table A. Overview'!E64)","v":1291449.0378922205},null,{"$f":"IF('Table A. Overview'!E65=\"\",'Table A. Overview'!M65,'Table A. Overview'!E65)","v":"NO"},{"$f":"SUM(G41:I41)","v":1291449.0378922205}]
[null,"III.2.1/2","Biological waste generated in the city",null,null,null,{"$f":"IF('Table A. Overview'!E68=\"\",'Table A. Overview'!M68,'Table A. Overview'!E68)","v":"NO"},null,{"$f":"IF('Table A. Overview'!E69=\"\",'Table A. Overview'!M69,'Table A. Overview'!E69)","v":"NO"},{"$f":"SUM(G42:I42)","v":0}]
[null,"III.3.1/2","Incinerated and burned waste generated in the city",null,null,null,{"$f":"IF('Table A. Overview'!E72=\"\",'Table A. Overview'!M72,'Table A. Overview'!E72)","v":"NO"},null,{"$f":"IF('Table A. Overview'!E73=\"\",'Table A. Overview'!M73,'Table A. Overview'!E73)","v":"NO"},{"$f":"SUM(G43:I43)","v":0}]
[null,"III.4.1/2","Wastewater generated in the city ",null,null,null,{"$f":"IF('Table A. Overview'!E76=\"\",'Table A. Overview'!M76,'Table A. Overview'!E76)","v":35213.692568407758},null,{"$f":"IF('Table A. Overview'!E77=\"\",'Table A. Overview'!M77,'Table A. Overview'!E77)","v":"NO"},{"$f":"SUM(G44:I44)","v":35213.692568407758}]
[null,"III.1.3","Solid waste generated outside the city",null,null,null,{"$f":"IF('Table A. Overview'!E66=\"\",'Table A. Overview'!M66,'Table A. Overview'!E66)","v":"NO"}]
[null,"III.2.3","Biological waste generated outside the city",null,null,null,{"$f":"IF('Table A. Overview'!E70=\"\",'Table A. Overview'!M70,'Table A. Overview'!E70)","v":"NO"}]
[null,"III.3.3","Incinerated and burned waste generated outside city  ",null,null,null,{"$f":"IF('Table A. Overview'!E74=\"\",'Table A. Overview'!M74,'Table A. Overview'!E74)","v":"NO"}]
[null,"III.4.3","Wastewater generated outside the city",null,null,null,{"$f":"IF('Table A. Overview'!E78=\"\",'Table A. Overview'!M78,'Table A. Overview'!E78)","v":"NO"}]
[null,"SUB-TOTAL","(city induced framework only)",null,null,null,{"$f":"SUM(G41:G44)","v":1326662.7304606284},null,{"$f":"SUM(I41:I44)","v":0},{"$f":"SUM(J41:J44)","v":1326662.7304606284}]
[null,"IV","INDUSTRIAL PROCESSES and PRODUCT USES"]
[null,"IV.1","Emissions from industrial processes occurring in the city boundary",null,null,null,{"$f":"IF('Table A. Overview'!E80=\"\",'Table A. Overview'!M80,'Table A. Overview'!E80)","v":53738},null,null,{"$f":"SUM(G51:I51)","v":53738}]
[null,"IV.2","Emissions from product use occurring within the city boundary",null,null,null,{"$f":"IF('Table A. Overview'!E81=\"\",'Table A. Overview'!M81,'Table A. Overview'!E81)","v":193540.9803106488},null,null,{"$f":"SUM(G52:I52)","v":193540.9803106488}]
[null,"SUB-TOTAL","(city induced framework only)",null,null,null,{"$f":"SUM(G51:G52)","v":247278.9803106488},null,null,{"$f":"SUM(J51:J52)","v":247278.9803106488}]
[null,"V","AGRICULTURE, FORESTRY and OTHER LAND USE"]
[null,"V.1","Emissions from livestock",null,null,null,{"$f":"IF('Table A. Overview'!E83=\"\",'Table A. Overview'!M83,'Table A. Overview'!E83)","v":"NE"},null,null,{"$f":"SUM(G55:I55)","v":0}]
[null,"V.2","Emissions from land",null,null,null,{"$f":"IF('Table A. Overview'!E84=\"\",'Table A. Overview'!M84,'Table A. Overview'!E84)","v":"NE"},null,null,{"$f":"SUM(G56:I56)","v":0}]
[null,"V.3","Emissions from aggregate sources and non-CO2 emission sources on land",null,null,null,{"$f":"IF('Table A. Overview'!E85=\"\",'Table A. Overview'!M85,'Table A. Overview'!E85)","v":"NE"},null,null,{"$f":"SUM(G57:I57)","v":0}]
[null,"SUB-TOTAL","(city induced framework only)",null,null,null,{"$f":"SUM(G55:G57)","v":0},null,null,{"$f":"SUM(J55:J57)","v":0}]
[null,"VI","OTHER SCOPE 3"]
[null,"VI.1","Other Scope 3",null,null,null,null,null,{"$f":"IF('Table A. Overview'!E87=\"\",'Table A. Overview'!M87,'Table A. Overview'!E87)","v":"NE"},{"$f":"SUM(G60:I60)","v":0}]
[null,"TOTAL","(city induced framework only)",null,null,null,{"$f":"G32+G39+G49+G53+G58+G60","v":18483916.269341163},{"$f":"H32+H39+H49+H53+H58+H60","v":15061660.848206963},{"$f":"I32+I39+I49+I53+I58+SUM(I60)","v":0},{"$f":"J32+J39+J49+J53+J58+J60","v":33545577.117548127}]
[]
[]
[null,"GPC GHG Summary Graphs"]
[]
[null,"                       BASIC                                                     BASIC+                                      BASIC+ Other scope 3",null,null,null,null,null,null,null,null,null,null,null,null,null,"BASIC","BASIC+","BASIC+ Other scope 3"]
[null,null,null,null,null,null,null,null,null,null,null,null,null,null,null,{"$f":"CONCATENATE(P75,\" mtCO2e\")","v":"33298000 mtCO2e"},{"$f":"CONCATENATE(Q75,\" mtCO2e\")","v":"33546000 mtCO2e"},{"$f":"CONCATENATE(R75,\" mtCO2e\")","v":"33546000 mtCO2e"}]
[null,null,null,null,null,null,null,null,null,null,null,null,null,null,"Stationary energy",{"$f":"H10","v":24873202.86329842},{"$f":"I10","v":24873202.86329842},{"$f":"I10","v":24873202.86329842},0]
[null,null,null,null,null,null,null,null,null,null,null,null,null,null,"Transportation",{"$f":"H12","v":7098432.5434784284},{"$f":"I12","v":7098432.5434784284},{"$f":"I12","v":7098432.5434784284},0]
[null,null,null,null,null,null,null,null,null,null,null,null,null,null,"Waste",{"$f":"H13","v":1326662.7304606284},{"$f":"I13","v":1326662.7304606284},{"$f":"I13","v":1326662.7304606284},0]
[null,null,null,null,null,null,null,null,null,null,null,null,null,null,"IPPU",null,{"$f":"I15","v":247278.9803106488},{"$f":"I15","v":247278.9803106488},0]
[null,null,null,null,null,null,null,null,null,null,null,null,null,null,"AFOLU",null,{"$f":"I16","v":0},{"$f":"I16","v":0},0]
[null,null,null,null,null,null,null,null,null,null,null,null,null,null,"Other scope 3",null,null,{"$f":"G17","v":""},0]
[null,null,null,null,null,null,null,null,null,null,null,null,null,null,"TOTAL",{"$f":"SUM(P68:P73)","v":33298298.137237478},{"$f":"SUM(Q68:Q73)","v":33545577.117548127},{"$f":"SUM(R68:R73)","v":33545577.117548127},0]
[null,null,null,null,null,null,null,null,null,null,null,null,null,null,null,{"$f":"ROUND(P74,-3)","v":33298000},{"$f":"ROUND(Q74,-3)","v":33546000},{"$f":"ROUND(R74,-3)","v":33546000}]
[]
[]
[]
[]
[null,"BASIC/BASIC+ by subsector and scope"]
[null,null,null,null,null,null,null,null,null,null,null,null,null,null,null,"Scope 1","Scope 2","Scope 3"]
[null,null,null,null,null,null,null,null,null,null,null,null,null,null,"Residential",{"$f":"G23/1000000","v":5.7152079086837153},4.0627337041084814,{"$error":"#VALUE!"}]
[null,null,null,null,null,null,null,null,null,null,null,null,null,null,"Commercial / institutional",2.9969491307490799,10.747371550037862,{"$error":"#VALUE!"}]
[null,null,null,null,null,null,null,null,null,null,null,null,null,null,"Manufacturing / construction",1.3509405697192827,{"$error":"#VALUE!"},{"$error":"#VALUE!"}]
[null,null,null,null,null,null,null,null,null,null,null,null,null,null,"Energy industries",{"$error":"#VALUE!"},{"$error":"#VALUE!"},{"$f":"I26/1000000","v":{"$error":"#VALUE!"}}]
[null,null,null,null,null,null,null,null,null,null,null,null,null,null,"Agriculture",{"$f":"G28/1000000","v":{"$error":"#VALUE!"}},{"$error":"#VALUE!"},{"$error":"#VALUE!"}]
[null,null,null,null,null,null,null,null,null,null,null,null,null,null,"Non-specified sources",{"$error":"#VALUE!"},{"$error":"#VALUE!"},{"$error":"#VALUE!"}]
[null,null,null,null,null,null,null,null,null,null,null,null,null,null,"Fugitive emissions (coal)",{"$error":"#VALUE!"},0,0]
[null,null,null,null,null,null,null,null,null,null,null,null,null,null,"Fugitive emissions (oil and gas)",{"$error":"#VALUE!"},0,0]
[null,null,null,null,null,null,null,null,null,null,null,null,null,null,"On-road",{"$f":"G34/1000000","v":6.7830312123398855},{"$error":"#VALUE!"},{"$error":"#VALUE!"}]
[null,null,null,null,null,null,null,null,null,null,null,null,null,null,"Railways",6.2587199999999996E-2,0.25155559406062283,{"$error":"#VALUE!"}]
[null,null,null,null,null,null,null,null,null,null,null,null,null,null,"Waterborne",2.4686441798931066E-4,{"$error":"#VALUE!"},{"$error":"#VALUE!"}]
[null,null,null,null,null,null,null,null,null,null,null,null,null,null,"Aviation",{"$error":"#VALUE!"},{"$error":"#VALUE!"},{"$error":"#VALUE!"}]
[null,null,null,null,null,null,null,null,null,null,null,null,null,null,"Off-road",1.0116726599300485E-3,{"$error":"#VALUE!"},{"$error":"#VALUE!"}]
[null,null,null,null,null,null,null,null,null,null,null,null,null,null,"Solid waste",{"$f":"G41/1000000","v":1.2914490378922205},0,{"$error":"#VALUE!"}]
[null,null,null,null,null,null,null,null,null,null,null,null,null,null,"Biological waste",{"$error":"#VALUE!"},0,{"$error":"#VALUE!"}]
[null,null,null,null,null,null,null,null,null,null,null,null,null,null,"Incineraton",{"$error":"#VALUE!"},0,{"$error":"#VALUE!"}]
[null,null,null,null,null,null,null,null,null,null,null,null,null,null,"Wastewater",3.5213692568407756E-2,0,{"$error":"#VALUE!"}]
[null,null,null,null,null,null,null,null,null,null,null,null,null,null,"Industrial processes",{"$f":"G51/1000000","v":5.3738000000000001E-2},0,0]
[null,null,null,null,null,null,null,null,null,null,null,null,null,null,"Product use",0.19354098031064879,0,0]
[null,null,null,null,null,null,null,null,null,null,null,null,null,null,"Livestock",{"$f":"G55/1000000","v":{"$error":"#VALUE!"}},0,0]
[null,null,null,null,null,null,null,null,null,null,null,null,null,null,"Land",{"$error":"#VALUE!"},0,0]
[null,null,"Subsector",null,null,null,null,null,null,null,null,null,null,null,"Aggregate sources",{"$error":"#VALUE!"},0,0]
[]
[null,"By scope"]
[null,null,null,null,null,null,null,null,null,null,null,null,null,null,null,"BASIC","BASIC+ (additional)","Other territorial","Other scope 3"]
[null,null,null,null,null,null,null,null,null,null,null,null,null,null,"Scope 1",{"$f":"(E10+E12+E13)/1000000","v":18.236637289030515},{"$f":"(E15+E16)/1000000","v":0.24727898031064879},{"$f":"(E11+E14)/1000000","v":{"$error":"#VALUE!"}}]
[null,null,null,null,null,null,null,null,null,null,null,null,null,null,"Scope 2",{"$f":"(F10+F12)/1000000","v":15.061660848206964}]
[null,null,null,null,null,null,null,null,null,null,null,null,null,null,"Scope 3",{"$f":"G13/1000000","v":0},{"$f":"(G10+G12)/1000000","v":0},null,{"$f":"G17/1000000","v":{"$error":"#VALUE!"}}]

{"sheet":"Lists","index":14,"n_rows":47,"n_cols":56,"rows_kept":47,"cut":false,"hidden":false,"merged":[[0,11,0,13],[0,52,0,54],[0,0,0,2],[0,41,0,44],[0,31,0,40],[0,45,0,50],[0,22,0,30],[0,14,0,21],[0,3,0,6]]}
["CITY INFORMATION","CITY INFORMATION",null,"INVENTORY INFORMATION",null,null,null,"EMISSION FACTORS",null,null,"NOTATION KEYS","SECTOR TABS","CITY INFORMATION",null,"STATIONARY ENERGY",null,null,null,null,null,null,null,"TRANSPORT",null,null,null,null,null,null,null,null,"WASTE",null,null,null,null,null,null,null,null,null,"IPPU",null,null,null,"AFOLU",null,null,null,null,null,"OTHER SCOPE 3","DATA SOURCES",null,null,"EMISSIONS"]
["Boundary","Economy","Climate","GPC","Gases","GWP","Audit","GPW","Type","Mass units","Notation keys","Data quality","Multiplier","Gases","Stationary","Grid","Energy Industries","1.A.1.a","Fugitive_Coal","1.B.1","Fugitive_Oil_Gas","1.B.2","Method","Road","1.A.3.B","Rail","1.A.3.C","Water","1.A.3.D","Air","1.A.3.A","Solid waste disposal","4.A","Biological treatment of solid waste","4.B","Incineration and open burning of waste","4.C","Wastewater treatment and discharge","4.D","Waste types","Organic waste types","Industrial processes","2.A, 2.B, 2.C","Product use","2.D, 2.E, 2.F, 2.G","Livestock","3.A","Land","3.B","Aggregate sources","3.C and 3.D","Scope 3","Reporting Period","Frequency","Scale","Data"]
[null,null,null,null,null,null,null,null,null,null,null,null,null,null,null,null,null,null,null,null,null,null,null,null,null,null,null,null,null,null,null,null,null,null,null," "]
["Please select","Please select","Please select","Please select","Please select","Please select","Please select","Please select","Please select","Please select","NO","L",1000000,"CO2","Please select","Please select","Please select",null,"Please select",null,"Please select",null,"Please select","Please select",null,"Please select",null,"Please select",null,"Please select",null,"Please select",null,"Please select",null,"Please select",null,"Please select",null,"Please select","Please select","Please select",null,"Please select","2.D, 2.E, 2.F, 2.G","Please select",null,"Please select",null,"Please select",null,"Please select","Please select","Please select","Please select","✓"]
["Administrative boundary of a local government ","Industry & Manufacturing","Tropical rainforest","BASIC","CO2","IPCC Fifth Assessment Report (2013)","Yes - audited","5AR","CO2e","g","IE","M",100000,"CH4","Gas (natural gas)","Electricity","Electricity generation","1.A.1.a.i","All activities","1.B.1","All activities","1.B.2","Fuel sales approach","Compressed natural gas (CNG)",null,"Diesel oil",null,"Compressed natural gas (CNG)",null,"Aviation gasoline",null,"Landfill sites - Methane commitment","4.A.1","All organic waste",null,"Open burning of waste","4.C.1","All wastewater","4.D","All waste","All organic waste","All industrial processes","2.A, 2.B, 2.C","All product use","2.D","All livestock","3.A","All land","3.B","Burning","3.C.1","Goods and services","Calendar year","Annual","Local"]
["Combination of administrative divisions","Services","Tropical monsoon","BASIC+","CO2, CH4, N2O","IPCC Fourth Assessment Report (2007)","Yes - verified","4AR","GHG","kg","NE","H",10000,"N2O","Compressed natural gas (CNG)","Electricity (CHP)","Combined heat and power generation (CHP)","1.A.1.a.ii","Coal mining and handling","1.B.1.a","Oil","1.B.2.a","City-induced activity","Gas oil ",null,"Electricity",null,"Gas oil ",null,"Jet gasoline",null,"Landfill sites - First order decay","4.A.1","Composting",null,"Waste incineration","4.C.2","Domestic wastewater","4.D.1","Municipal solid waste","Food waste","Mineral industry","2.A","Non-energy products from fuels and solvent use","2.D","Cattle","3.A.1.a/3.A.2.a","Forest land","3.B.1","  Burning in Forest land","3.C.1.a","Food","Financial year","Every 2 years","Metro"]
["A metropolitan area","Agriculture & Fishing","Tropical savannah","BASIC+ Other scope 3","All GHGs","IPCC Third Assessment Report (2001)","No","3AR",null,"t","C",null,1000,"CO2, CH4","Crude oil ","Heating","Heat plants","1.A.1.a.iii","  Underground mines","1.B.1.a.i","  Venting","1.B.2.a.i","Geographic / Territorial","Diesel oil",null,"Distance travelled (vehicle)",null,"Diesel oil",null,"Jet kerosene",null,"Other managed waste disposal site(s)","4.A.1","Anaerobic digestion",null,null,null,"Industrial wastewater","4.D.2","Sludge","Garden and park waste","  Cement production","2.A.1","  Lubricant use","2.D.1","Buffalo","3.A.1.b/3.A.2.b","  Forest land remaining Forest land","3.B.1.a","  Burning in Cropland","3.C.1.b","Construction","Other (please specify)","Every 3 years","Regional"]
["Other (please specify)","Other (please specify)","Dry desert",null,null,"IPCC Second Assessment Report (1995)",null,"2AR",null,"lt",null,null,100,"CO2, N2O","Gas oil ","Heating (CHP)","Other (please specify)",null,"    Mining","1.B.1.a.i.1","  Flaring","1.B.2.a.ii","Resident activity","Motor gasoline (petrol)",null,"Distance travelled (passenger)",null,"Motor gasoline (petrol)",null,"Electricity",null,"Unmanaged waste disposal sites","4.A.2","Other (please specify)",null,null,null,null,null,"Industrial waste","Sludge","  Lime production","2.A.1","  Parraffin wax use","2.D.2","Sheep","3.A.1.c/3.A.2.c","  Crop land converted to Forest land","3.B.1.b.i","  Burning in Grassland","3.C.1.c","Upstream emissions from energy use",null,"Every 4 years","National"]
[null,null,"Dry steppe (hot)",null,null,null,null,null,null,"st",null,null,10,"CH4, N2O","Diesel oil ","Steam",null,null,"    Post-mining seam gas emissions","1.B.1.a.i.2","  Exploration","1.B.2.a.iii.1",null,"Kerosene",null,"Distance travelled (freight)",null,"Kerosene",null,"Distance travelled (vehicle)",null,"Uncategorised waste disposal sites","4.A.3",null,null,null,null,null,null,"Other (please specify)","Other (please specify)","  Glass production","2.A.3","  Solvent use","2.D.3","Goats","3.A.1.d/3.A.2.d","  Grassland converted to Forest land","3.B.1.b.ii","  Burning in All Other land","3.C.1.d","Other (please specify)",null,"Every 5 years","International"]
[null,null,"Dry steppe (cold)",null,null,null,null,null,null,"lb",null,null,1,"CO2, CH4, N2O","Motor gasoline (petrol)","Steam (CHP)",null,null,"    Abandoned underground mines","1.B.1.a.i.3","  Production and Upgrading","1.B.2.a.iii.2",null,"Residual fuel oil ",null,"Travel expenditure",null,"Residual fuel oil ",null,"Distance travelled (passenger)",null,null,null,null,null,null,null,null,null,null,null,"  Other Process Uses of Carbonates","2.A.4","Electronics industry","2.E","Camels","3.A.1.e/3.A.2.e","  Settlements converted to Forest land","3.B.1.b.iv","Liming","3.C.2",null,null,"As required","Other (please specify)"]
[null,null,"Temperate, dry summer (Mediterranean)",null,null,null,null,null,null,"Other (please specify)",null,null,0.1,"HFCs","Kerosene ","Cooling",null,null,"    Flaring of drained CH4 or conversion of CH4 to CO2","1.B.1.a.i.4","  Transport","1.B.2.a.iii.3",null,"Liquefied petroleum gas (LPG)",null,"Travel time",null,"Liquefied petroleum gas (LPG)",null,"Distance travelled (freight)",null,null,null,null,null,null,null,null,null,null,null,"Chemical industry","2.B","  Integrated circuit or semiconductor","2.E.1","Horses","3.A.1.f/3.A.2.f","  Wetlands converted to Forest land","3.B.1.b.iii","Urea fertilization","3.C.3",null,null,"Once"]
[null,null,"Temperate, dry winter",null,null,null,null,null,null,null,null,null,0.01,"PFCs","Residual fuel oil ","Cooling (CHP)",null,null,"  Surface mines","1.B.1.a.ii","  Refining","1.B.2.a.iii.4",null,"Liquefied natural gas (LNG)",null,"T&D losses from grid-supplied energy consumption",null,"Liquefied natural gas (LNG)",null,"Travel expenditure",null,null,null,null,null,null,null,null,null,null,null,"  Ammonia production","2.B.1","  TFT flat panel display","2.E.2","Mules and Asses","3.A.1.g/3.A.2.g","  Other land converted to Forest land","3.B.1.b.v","Direct N2O from managed soils","3.C.4",null,null,"Other (please specify)"]
[null,null,"Temperate, hot summer",null,null,null,null,null,null,null,null,null,1E-3,"SF6","Liquefied petroleum gases (LPG)","Other (please specify)",null,null,"    Mining","1.B.1.a.ii.1","  Distribution of oil products","1.B.2.a.iii.5",null,"Biogasoline",null,"Other (please specify)",null,"Biogasoline",null,"Travel time",null,null,null,null,null,null,null,null,null,null,null,"  Nitric acid production","2.B.2","  Photovoltaics","2.E.3","Swine","3.A.1.h/3.A.2.h","Crop land","3.B.2","Indirect N2O from managed soils","3.C.5"]
[null,null,"Temperate, warm summer",null,null,null,null,null,null,null,null,null,1E-4,"HFCs, PFCs","Liquefied natural gas (LNG)",null,null,null,"    Post-mining seam gas emissions","1.B.1.a.ii.2","  Other","1.B.2.a.iii.6",null,"Biodiesels",null,null,null,"Biodiesels",null,"T&D losses from grid-supplied energy consumption",null,null,null,null,null,null,null,null,null,null,null,"  Adipic acid production","2.B.3","  Heat transfer fluid","2.E.4","Poultry","3.A.2.i","  Crop land remaining Crop land","3.B.2.a","Indirect N2O from manure management","3.C.6"]
[null,null,"Temperate, cold summer",null,null,null,null,null,null,null,null,null,1.0000000000000001E-5,"HFCs, SF6","Naphtha ",null,null,null,"Uncontrolled combustion and burning coal dumps","1.B.1.b","Natural gas","1.B.2.b",null,"Methanol",null,null,null,"Methanol",null,"Other (please specify)",null,null,null,null,null,null,null,null,null,null,null,"  Caprolactam production","2.B.4","Product uses as substitutes for ozone depleting substances","2.F","Other (please specify)","3.A.1.J/3.A.2.J","  Forest land converted to Crop land","3.B.2.b.i","Rice cultivations","3.C.7"]
[null,null,"Cold, dry summer",null,null,null,null,null,null,null,null,null,9.9999999999999995E-7,"PFCs, SF6","Bitumen ",null,null,null,"Solid fuel transformation","1.B.1.c","  Venting","1.B.2.b.i",null,"Ethanol",null,null,null,"Ethanol",null,null,null,null,null,null,null,null,null,null,null,null,null,"  Carbide production","2.B.5","  Refrigeration and air conditioning","2.F.1",null,null,"  Grassland converted to Crop land","3.B.2.b.ii","CH4 from drained organic soils","3.C.8"]
[null,null,"Cold, dry winter",null,null,null,null,null,null,null,null,null,9.9999999999999995E-8,"HFCs, PFCs, SF6","Lubricants ",null,null,null,"Other (please specify)",null,"  Flaring","1.B.2.b.ii",null,"E85",null,null,null,"E85",null,null,null,null,null,null,null,null,null,null,null,null,null,"  Titanium dioxide production","2.B.6","    Refrigeration and stationary air conditioning","2.F.1.a",null,null,"  Settlements converted to Crop land","3.B.2.b.iv","CH4 from drainage ditches on organic soils","3.C.9"]
[null,null,"Cold, hot summer",null,null,null,null,null,null,null,null,null,"Other (please specify)","NF3","Petroleum coke ",null,null,null,null,null,"  Exploration","1.B.2.b.iii.1",null,"Other liquid biofuels",null,null,null,"Other liquid biofuels",null,null,null,null,null,null,null,null,null,null,null,null,null,"  Soda ash production","2.B.7","    Mobile air conditioning","2.F.1.b",null,null,"  Wetlands converted to Crop land","3.B.2.b.iii","CH4 from rewetting of organic soils","3.C.10"]
[null,null,"Cold, warm summer",null,null,null,null,null,null,null,null,null,null,"All F-gases","Coal (bituminous or black coal)",null,null,null,null,null,"  Production","1.B.2.b.iii.2",null,"Other biogas",null,null,null,"Other biogas",null,null,null,null,null,null,null,null,null,null,null,null,null,"  Petrochemical and black carbon production","2.B.8","  Foam blowing agents","2.F.2",null,null,"  Other land converted to Crop land","3.B.2.b.v","CH4 emissions from rewetting of mangroves and tidal marshes","3.C.11"]
[null,null,"Cold, cold summer",null,null,null,null,null,null,null,null,null,null,"All GHGs","Coal (coke)",null,null,null,null,null,"  Processing","1.B.2.b.iii.3",null,"Electricity",null,null,null,"Electricity",null,null,null,null,null,null,null,null,null,null,null,null,null,"  Fluorochemical production","2.B.9","  Fire protection","2.F.3",null,null,"Grassland","3.B.3","N2O emissions from aquaculture","3.C.12"]
[null,null,"Cold, very cold winter",null,null,null,null,null,null,null,null,null,null,null,"Coal (manufactured solid fuels)",null,null,null,null,null,"  Transmission and storage","1.B.2.b.iii.4",null,"Distance travelled (vehicle)",null,null,null,"Distance travelled (vehicle)",null,null,null,null,null,null,null,null,null,null,null,null,null,"Metal industry","2.C","  Aerosols","2.F.4",null,null,"  Grassland remaining Grassland","3.B.3.a","CH4 emissions from rewetted and created wetlands on inland wetland mineral soils","3.C.13"]
[null,null,"Polar, tundra",null,null,null,null,null,null,null,null,null,null,null,"Municipal wastes (all) ",null,null,null,null,null,"  Distribution","1.B.2.b.iii.5",null,"Distance travelled (passenger)",null,null,null,"Distance travelled (passenger)",null,null,null,null,null,null,null,null,null,null,null,null,null,"  Iron and steel production","2.C.1","  Solvents","2.F.5",null,null,"  Forest land converted to Grassland","3.B.3.b.i","Harvested wood products","3.D.1"]
[null,null,"Polar, frost",null,null,null,null,null,null,null,null,null,null,null,"Municipal wastes (non-biomass fraction) ",null,null,null,null,null,"Other (please specify)","1.B.2.b.iii.6",null,"Distance travelled (freight)",null,null,null,"Distance travelled (freight)",null,null,null,null,null,null,null,null,null,null,null,null,null,"  Ferroalloy production","2.C.2","Other product manufacture and use","2.G",null,null,"  Crop land converted to Grassland","3.B.3.b.ii","Other (please specify)","3.C.14 or 3.D.2"]
[null,null,null,null,null,null,null,null,null,null,null,null,null,null,"Municipal wastes (biomass fraction) ",null,null,null,null,null,null,null,null,"Travel expenditure",null,null,null,"Travel expenditure",null,null,null,null,null,null,null,null,null,null,null,null,null,"  Aluminium production","2.C.3","  Electrical equipment","2.G.1",null,null,"  Wetlands converted to Grassland","3.B.3.b.iii"]
[null,null,null,null,null,null,null,null,null,null,null,null,null,null,"Wood or wood waste ",null,null,null,null,null,null,null,null,"Travel time",null,null,null,"Travel time",null,null,null,null,null,null,null,null,null,null,null,null,null,"  Magnesium production","2.C.4","  SF6 and PFCs from other product uses","2.G.2",null,null,"  Settlements converted to Grassland","3.B.3.b.iv"]
[null,null,null,null,null,null,null,null,null,null,null,null,null,null,"Charcoal ",null,null,null,null,null,null,null,null,"T&D losses from grid-supplied energy consumption",null,null,null,"T&D losses from grid-supplied energy consumption",null,null,null,null,null,null,null,null,null,null,null,null,null,"  Lead production","2.C.5","  N2O from product uses","2.G.3",null,null,"  Other land converted to Grassland","3.B.3.b.v"]
[null,null,null,null,null,null,null,null,null,null,null,null,null,null,"Biogasoline ",null,null,null,null,null,null,null,null,"Other (please specify)",null,null,null,"Other (please specify)",null,null,null,null,null,null,null,null,null,null,null,null,null,"  Zinc production","2.C.6","Other","2.H",null,null,"Wetlands","3.B.4"]
[null,null,null,null,null,null,null,null,null,null,null,null,null,null,"Biodiesels ",null,null,null,null,null,null,null,null,null,null,null,null,null,null,null,null,null,null,null,null,null,null,null,null,null,null,"Other (please specify)","2.A.5, 2.B.10 or 2.C.7","  Pulp and paper industry","2.H.1",null,null,"  Wetlands remaining Wetlands","3.B.4.a"]
[null,null,null,null,null,null,null,null,null,null,null,null,null,null,"Methanol",null,null,null,null,null,null,null,null,null,null,null,null,null,null,null,null,null,null,null,null,null,null,null,null,null,null,null,null,"  Food and beverages industry","2.H.2",null,null,"  Forest land converted to Wetlands","3.B.4.b"]
[null,null,null,null,null,null,null,null,null,null,null,null,null,null,"Ethanol",null,null,null,null,null,null,null,null,null,null,null,null,null,null,null,null,null,null,null,null,null,null,null,null,null,null,null,null,"Other (please specify)","2.D.4, 2.E.5, 2.F.6, 2.G.4 or 2.H.3",null,null,"  Crop land converted to Wetlands","3.B.4.b"]
[null,null,null,null,null,null,null,null,null,null,null,null,null,null,"E85",null,null,null,null,null,null,null,null,null,null,null,null,null,null,null,null,null,null,null,null,null,null,null,null,null,null,null,null,null,null,null,null,"  Grassland converted to Wetlands","3.B.4.b"]
[null,null,null,null,null,null,null,null,null,null,null,null,null,null,"Sewage sludge ",null,null,null,null,null,null,null,null,null,null,null,null,null,null,null,null,null,null,null,null,null,null,null,null,null,null,null,null,null,null,null,null,"  Settlements converted to Wetlands","3.B.4.b"]
[null,null,null,null,null,null,null,null,null,null,null,null,null,null,"Other liquid biofuels ",null,null,null,null,null,null,null,null,null,null,null,null,null,null,null,null,null,null,null,null,null,null,null,null,null,null,null,null,null,null,null,null,"  Other land converted to Wetlands","3.B.4.b"]
[null,null,null,null,null,null,null,null,null,null,null,null,null,null,"Landfill gas ",null,null,null,null,null,null,null,null,null,null,null,null,null,null,null,null,null,null,null,null,null,null,null,null,null,null,null,null,null,null,null,null,"Settlements","3.B.5"]
[null,null,null,null,null,null,null,null,null,null,null,null,null,null,"Sludge gas ",null,null,null,null,null,null,null,null,null,null,null,null,null,null,null,null,null,null,null,null,null,null,null,null,null,null,null,null,null,null,null,null,"  Settlements remaining Settlements","3.B.5.a"]
[null,null,null,null,null,null,null,null,null,null,null,null,null,null,"Other biogas ",null,null,null,null,null,null,null,null,null,null,null,null,null,null,null,null,null,null,null,null,null,null,null,null,null,null,null,null,null,null,null,null,"  Forest land converted to Settlements","3.B.5.b.i"]
[null,null,null,null,null,null,null,null,null,null,null,null,null,null,"Other (please specify)",null,null,null,null,null,null,null,null,null,null,null,null,null,null,null,null,null,null,null,null,null,null,null,null,null,null,null,null,null,null,null,null,"  Crop land converted to Settlements","3.B.5.b.ii"]
[null,null,null,null,null,null,null,null,null,null,null,null,null,null,null,null,null,null,null,null,null,null,null,null,null,null,null,null,null,null,null,null,null,null,null,null,null,null,null,null,null,null,null,null,null,null,null,"  Grassland converted to Settlements","3.B.5.b.iii"]
[null,null,null,null,null,null,null,null,null,null,null,null,null,null,null,null,null,null,null,null,null,null,null,null,null,null,null,null,null,null,null,null,null,null,null,null,null,null,null,null,null,null,null,null,null,null,null,"  Wetlands converted to Settlements","3.B.5.b.iv"]
[null,null,null,null,null,null,null,null,null,null,null,null,null,null,null,null,null,null,null,null,null,null,null,null,null,null,null,null,null,null,null,null,null,null,null,null,null,null,null,null,null,null,null,null,null,null,null,"  Other land converted to Settlements","3.B.5.b.v"]
[null,null,null,null,null,null,null,null,null,null,null,null,null,null,null,null,null,null,null,null,null,null,null,null,null,null,null,null,null,null,null,null,null,null,null,null,null,null,null,null,null,null,null,null,null,null,null,"Other land","3.B.6"]
[null,null,null,null,null,null,null,null,null,null,null,null,null,null,null,null,null,null,null,null,null,null,null,null,null,null,null,null,null,null,null,null,null,null,null,null,null,null,null,null,null,null,null,null,null,null,null,"  Other land remaining Other land","3.B.6.a"]
[null,null,null,null,null,null,null,null,null,null,null,null,null,null,null,null,null,null,null,null,null,null,null,null,null,null,null,null,null,null,null,null,null,null,null,null,null,null,null,null,null,null,null,null,null,null,null,"  Forest land converted to Other land","3.B.6.b.i"]
[null,null,null,null,null,null,null,null,null,null,null,null,null,null,null,null,null,null,null,null,null,null,null,null,null,null,null,null,null,null,null,null,null,null,null,null,null,null,null,null,null,null,null,null,null,null,null,"  Crop land converted to Other land","3.B.6.b.ii"]
[null,null,null,null,null,null,null,null,null,null,null,null,null,null,null,null,null,null,null,null,null,null,null,null,null,null,null,null,null,null,null,null,null,null,null,null,null,null,null,null,null,null,null,null,null,null,null,"  Grassland converted to Other land","3.B.6.b.iii"]
[null,null,null,null,null,null,null,null,null,null,null,null,null,null,null,null,null,null,null,null,null,null,null,null,null,null,null,null,null,null,null,null,null,null,null,null,null,null,null,null,null,null,null,null,null,null,null,"  Wetlands converted to Other land","3.B.6.b.iv"]
[null,null,null,null,null,null,null,null,null,null,null,null,null,null,null,null,null,null,null,null,null,null,null,null,null,null,null,null,null,null,null,null,null,null,null,null,null,null,null,null,null,null,null,null,null,null,null,"  Settlements converted to Other land","3.B.6.b.v"]