{"text_format":"1","workbook":"xlsx","n_sheets":15,"sheets":["Revision history","Reference Tables","City information","Data sources","Emission factors","I - Stationary","II - Transport","III - Waste","IV - IPPU","V - AFOLU","VI - Other scope 3","Table A. Overview","Graphs","Table B. Summary","Lists"],"not_rendered":{"charts":6,"images":1,"macros":1,"external_links":8,"defined_names":116,"comments":2,"pivot_tables":0},"unopened":[],"bounds":{"document_bytes":16777216,"sheet_cells":100000,"rows_first":2000,"rows_last":500,"rows_between":2000,"halvings":0,"cell_chars":16384,"cell_head_chars":4096},"cells_cut":0,"cells_raw":0,"read":"whole","date_system":"1900"}

{"sheet":"Revision history","index":0,"n_rows":14,"n_cols":6,"rows_kept":14,"cut":false,"hidden":false,"merged":[[7,1,14,1]]}
[]
[null,"REVISION HISTORY"]
[]
[null,"Version / Revision","Sheet","Change","Date","Name"]
[]
[null,"1.0_ENG",null,"Created reporting tool","May 2015","Michael Doust"]
{"$rows_left_out":9}
{"sheet":"Reference Tables","index":1,"n_rows":158,"n_cols":15,"rows_kept":158,"cut":false,"hidden":false,"merged":[[18,1,18,4],[19,1,19,4],[20,1,20,4],[101,1,101,2],[90,1,90,2],[92,1,92,2],[93,1,93,2],[95,1,95,2],[96,1,96,2],[97,1,97,2],[21,1,21,4],[22,1,22,4],[33,1,33,4],[34,1,34,4],[37,1,37,4],[36,1,36,4],[24,1,24,4],[25,1,25,4],[26,1,26,4],[27,1,27,4],[38,1,38,4],[89,1,89,2],[89,3,89,4],[88,1,88,2],[5,1,5,4],[7,1,7,4],[8,1,8,4],[9,1,9,4],[10,1,10,4],[11,1,11,4],[12,1,12,4],[13,1,13,4],[14,1,14,4],[86,3,86,4],[87,3,87,4],[88,3,88,4],[87,1,87,2],[122,4,123,4],[133,4,134,4],[83,5,83,8],[103,1,103,2],[104,1,104,2],[145,9,146,9],[112,1,113,1],[112,3,113,3],[112,4,113,4],[112,5,113,5],[112,6,113,6],[112,7,113,7],[122,3,123,3],[122,1,123,1],[122,5,123,5],[122,6,123,6],[122,7,123,7],[145,1,146,1],[145,3,146,3],[145,4,146,4],[145,5,146,5],[145,6,146,6],[145,7,146,7],[145,8,146,8],[133,6,134,6],[133,7,134,7],[133,9,134,9],[52,11,53,13],[52,14,53,19],[122,8,123,8],[133,1,134,1],[133,3,134,3],[133,5,134,5],[83,1,83,4],[84,1,84,2],[84,3,84,4],[86,1,86,2],[104,3,104,4],[91,1,91,2],[94,1,94,2],[102,1,102,2],[98,1,98,2],[99,1,99,2],[100,1,100,2],[73,14,74,19],[75,14,76,19],[77,14,78,19],[67,14,68,19],[69,14,70,19],[71,14,72,19],[133,8,134,8],[63,14,64,19],[55,14,56,19],[55,13,56,13],[57,14,58,19],[59,14,60,19],[61,14,62,19],[65,14,66,19],[61,13,62,13],[67,13,68,13],[75,13,78,13],[73,13,74,13],[55,11,56,12],[61,11,62,12],[67,11,68,12],[73,11,74,12],[57,13,60,13],[63,13,66,13],[69,13,72,13]]}
[]
[null,"REFERENCE TABLES"]
[]
[null,"A. GPC OVERVIEW "]
[]
[null,"Sectors and sub-sectors",null,null,null,null,null,null,"Scope 1","Scope 2","Scope 3"]
{"$rows_left_out":153}
{"sheet":"City information","index":2,"n_rows":90,"n_cols":11,"rows_kept":90,"cut":false,"hidden":false,"merged":[[82,1,83,1],[62,1,63,1],[71,1,72,1],[51,2,51,3],[51,4,51,5],[71,2,72,2],[62,2,63,2],[51,1,52,1],[44,2,44,3],[5,4,6,5],[13,4,13,5],[12,4,12,5],[23,1,23,5],[37,1,38,1],[13,2,13,3],[14,2,14,3],[15,2,15,3],[16,2,16,3],[8,4,8,5],[8,2,8,3],[9,2,9,3],[10,2,10,3],[29,2,29,5],[30,2,30,5],[7,1,7,5],[5,1,6,1],[41,2,41,3],[21,1,22,1],[5,2,6,3],[37,2,38,3],[40,2,40,3],[31,2,31,5],[32,2,32,5],[33,2,33,5],[24,2,24,5],[25,2,25,5],[26,2,26,5],[27,2,27,5],[28,2,28,5],[42,2,42,3],[43,2,43,3],[11,4,11,5],[10,4,10,5],[9,4,9,5],[17,2,17,3],[17,4,17,5],[16,4,16,5],[15,4,15,5],[14,4,14,5],[21,2,22,5],[11,2,11,3],[12,2,12,3],[45,2,45,3],[82,9,83,9],[82,10,83,10],[82,2,82,3],[82,4,83,4],[82,7,82,8],[51,6,52,6],[82,6,83,6],[82,5,83,5]]}
[]
[null,"CITY INFORMATION"]
[]
[null,"A. INVENTORY BOUNDARY (GPC table 4.1 page 40)"]
[]
[null,"Boundary","Information",null,"Reference(s)"]
{"$rows_left_out":85}
{"sheet":"Data sources","index":3,"n_rows":30,"n_cols":11,"rows_kept":30,"cut":false,"hidden":false,"merged":[[5,8,6,8],[5,10,6,10],[5,7,6,7],[5,1,6,1],[5,2,6,2],[5,9,6,9],[5,4,6,4],[5,5,6,5],[5,6,6,6],[5,3,6,3]]}
[]
[null,"DATA SOURCES"]
[]
[null,"Use this table to record all the data sources used to compile the inventory. References provided in column C may be used to select the relevant data sources in the emission factors and sector tabs."]
[]
[null,"Data","Name of source","Provider","Reporting period","Frequency","Release date","Scale","Available from","Latest year","Link"]
{"$rows_left_out":25}
{"sheet":"Emission factors","index":4,"n_rows":42,"n_cols":73,"rows_kept":42,"cut":false,"hidden":false,"merged":[[6,72,7,72],[6,71,7,71],[6,3,7,3],[6,9,6,67],[6,5,7,7],[6,8,7,8],[3,65,4,65],[6,1,7,1],[6,70,7,70],[6,69,7,69],[6,2,7,2],[6,4,7,4],[44,23,44,24],[45,23,45,24],[46,23,46,24],[47,23,47,24],[48,23,48,24],[54,23,54,24],[55,23,55,24],[49,23,49,24],[50,23,50,24],[51,23,51,24],[52,23,52,24],[53,23,53,24]]}
[]
[null,"EMISSION FACTORS",null,null,null,null,null,null,null,null,null,null,null,null,null,null,null,null,null,null,null,null,null,null,null,null,null,null,null,null,null,null,null,null,null,null,null,null,null,null,null,null,null,null,null,null,null,null,null,null,null,null,null,null,null,null,null,null,null,null,null,null,null,null,null,""]
[]
[null,"Use this table to record the emission factors used to calculate GHG emissions from all the activities included in the inventory. ",null,null,null,null,null,null,null,null,null,null,null,null,null,null,null,null,null,null,null,null,null,null,null,null,null,null,null,null,null,null,null,null,null,null,null,null,null,null,null,null,null,null,null,null,null,null,null,null,null,null,null,null,null,null,null,null,null,null,null,null,null,null,null,"F gases"]
[null,"References provided in column D shall be used to identify the relevant emission factors in the sector tabs."]
[]
{"$rows_left_out":37}
{"sheet":"I - Stationary","index":5,"n_rows":121,"n_cols":35,"rows_kept":121,"cut":false,"hidden":false,"merged":[[23,1,24,1],[23,2,24,2],[23,5,24,5],[23,6,23,7],[23,25,23,29],[23,30,23,31],[23,32,24,32],[7,1,8,1],[7,2,8,2],[7,5,8,5],[7,6,7,7],[7,3,7,4],[7,25,7,29],[23,8,23,10],[23,3,23,4],[7,20,7,24],[7,13,7,18],[7,12,8,12],[23,19,24,19],[61,1,62,1],[61,2,62,2],[61,5,62,5],[61,6,61,7],[61,25,61,29],[61,30,61,31],[61,32,62,32],[46,1,47,1],[46,2,47,2],[46,5,47,5],[46,6,46,7],[46,3,46,4],[46,25,46,29],[46,30,46,31],[61,3,61,4],[61,19,62,19],[92,1,93,1],[92,2,93,2],[92,5,93,5],[92,6,92,7],[92,25,92,29],[92,12,93,12],[78,1,79,1],[78,2,79,2],[78,5,79,5],[78,6,78,7],[78,3,78,4],[78,25,78,29],[78,11,79,11],[92,11,93,11],[92,3,92,4],[78,8,78,10],[92,8,92,10],[78,12,79,12],[78,19,79,19],[92,19,93,19],[78,13,78,18],[78,20,78,24],[92,13,92,18],[92,20,92,24],[114,1,115,1],[114,2,115,2],[114,5,115,5],[114,6,114,7],[114,25,114,29],[114,30,114,31],[114,32,115,32],[106,1,107,1],[106,2,107,2],[106,5,107,5],[106,6,106,7],[106,3,106,4],[106,8,106,10],[114,3,114,4],[106,11,107,11],[114,11,115,11],[114,8,114,10],[106,12,107,12],[114,12,115,12],[106,25,106,29],[106,30,106,31],[106,32,107,32],[106,19,107,19],[114,19,115,19],[114,34,115,34],[7,34,8,34],[23,34,24,34],[46,34,47,34],[61,34,62,34],[78,34,79,34],[92,33,93,33],[106,33,107,33],[114,33,115,33],[7,33,8,33],[23,33,24,33],[46,33,47,33],[61,33,62,33],[78,33,79,33],[3,6,4,7],[1,6,1,7],[92,34,93,34],[106,34,107,34],[92,32,93,32],[46,8,46,10],[61,8,61,10],[61,12,62,12],[7,30,7,31],[46,32,47,32],[7,8,7,10],[61,11,62,11],[7,11,8,11],[23,11,24,11],[46,11,47,11],[23,12,24,12],[46,12,47,12],[78,30,78,31],[78,32,79,32],[1,33,1,34],[3,33,4,34],[92,30,92,31],[7,32,8,32],[46,19,47,19],[106,13,106,18],[106,20,106,24],[114,13,114,18],[114,20,114,24],[3,12,4,12],[3,19,4,19],[7,19,8,19],[23,13,23,18],[23,20,23,24],[46,13,46,18],[46,20,46,24],[61,13,61,18],[61,20,61,24]]}
[]
[null,"I STATIONARY ENERGY",null,null,null,null,"",null,null,null,null,null,"",null,null,null,null,null,null,"",null,null,null,null,null,null,null,null,null,null,null,null,null,""]
[]
[null,"Use this tab to record activity and emissions data for Stationary energy sources. Emission factors should be recorded in the 'Emission factors' tab.",null,null,null,null,"Convert activity data units",null,null,null,null,null,"View emission factor(s)",null,null,null,null,null,null,"Enter emissions data",null,null,null,null,null,null,null,null,null,null,null,null,null,"Data quality explanation (optional)"]
[]
[null,"I.1 RESIDENTIAL BUILDINGS"]
{"$rows_left_out":116}
{"sheet":"II - Transport","index":6,"n_rows":97,"n_cols":36,"rows_kept":97,"cut":false,"hidden":false,"merged":[[84,26,84,30],[84,31,84,32],[84,33,85,33],[42,26,42,30],[42,31,42,32],[70,26,70,30],[70,31,70,32],[56,26,56,30],[42,33,43,33],[56,31,56,32],[56,33,57,33],[84,34,85,34],[84,35,85,35],[7,35,8,35],[42,34,43,34],[42,35,43,35],[56,34,57,34],[56,35,57,35],[7,34,8,34],[70,34,71,34],[7,1,8,1],[7,2,8,2],[7,6,8,6],[7,26,7,30],[7,3,7,5],[7,13,8,13],[7,12,8,12],[7,14,7,19],[7,20,8,20],[7,21,7,25],[56,1,57,1],[56,2,57,2],[56,3,56,5],[56,6,57,6],[56,7,56,8],[42,1,43,1],[42,2,43,2],[42,3,42,5],[42,6,43,6],[42,7,42,8],[70,1,71,1],[70,2,71,2],[70,3,70,5],[70,6,71,6],[70,7,70,8],[84,1,85,1],[84,2,85,2],[84,3,84,5],[84,6,85,6],[84,7,84,8],[1,34,1,35],[3,34,4,35],[42,12,43,12],[56,12,57,12],[70,12,71,12],[42,13,43,13],[56,13,57,13],[70,13,71,13],[70,33,71,33],[42,20,43,20],[56,20,57,20],[70,20,71,20],[7,33,8,33],[7,31,7,32],[70,35,71,35],[42,21,42,25],[1,7,1,8],[3,7,4,8],[3,13,4,13],[3,20,4,20],[84,12,85,12],[7,9,7,11],[84,13,85,13],[7,7,7,8],[42,14,42,19],[56,14,56,19],[42,9,42,11],[56,9,56,11],[70,9,70,11],[84,9,84,11],[56,21,56,25],[70,14,70,19],[70,21,70,25],[84,14,84,19],[84,21,84,25],[84,20,85,20]]}
[]
[null,"II TRANSPORTATION",null,null,null,null,null,"",null,null,null,null,null,"",null,null,null,null,null,null,"",null,null,null,null,null,null,null,null,null,null,null,null,null,""]
[]
[null,"Use this tab to record activity and emissions data for Transportation sources. Emission factors should be recorded in the 'Emission factors' tab.",null,null,null,null,null,"Convert activity data units",null,null,null,null,null,"View emission factor(s)",null,null,null,null,null,null,"Enter emissions data",null,null,null,null,null,null,null,null,null,null,null,null,null,"Data quality explanation (optional)"]
[]
[null,"II.1 ON-ROAD TRANSPORTATION"]
{"$rows_left_out":92}
{"sheet":"III - Waste","index":7,"n_rows":63,"n_cols":36,"rows_kept":63,"cut":false,"hidden":false,"merged":[[49,13,50,13],[49,12,50,12],[49,9,49,11],[49,14,49,19],[49,34,50,34],[49,20,50,20],[49,21,49,25],[49,35,50,35],[49,26,49,30],[49,31,49,32],[49,33,50,33],[7,34,8,34],[7,35,8,35],[21,34,22,34],[21,35,22,35],[35,34,36,34],[35,35,36,35],[35,31,35,32],[35,33,36,33],[35,26,35,30],[7,31,7,32],[7,33,8,33],[21,26,21,30],[59,3,59,4],[60,3,60,4],[50,3,50,4],[52,3,52,4],[53,3,53,4],[56,3,56,4],[57,3,57,4],[54,3,54,4],[49,1,50,1],[49,2,50,2],[49,6,50,6],[49,7,49,8],[49,3,49,5],[35,1,36,1],[35,2,36,2],[35,6,36,6],[35,7,35,8],[35,3,35,5],[35,21,35,25],[21,9,21,11],[21,14,21,19],[21,20,22,20],[21,21,21,25],[35,13,36,13],[35,12,36,12],[35,9,35,11],[35,14,35,19],[35,20,36,20],[21,1,22,1],[21,2,22,2],[21,6,22,6],[21,7,21,8],[21,3,21,5],[7,1,8,1],[7,2,8,2],[7,6,8,6],[7,26,7,30],[7,3,7,5],[7,13,8,13],[7,12,8,12],[7,9,7,11],[7,14,7,19],[7,20,8,20],[7,21,7,25],[7,7,7,8],[1,34,1,35],[3,7,4,8],[3,13,4,13],[3,20,4,20],[3,34,4,35],[21,31,21,32],[21,33,22,33],[21,13,22,13],[21,12,22,12],[1,7,1,8]]}
[]
[null,"III WASTE",null,null,null,null,null,"",null,null,null,null,null,"",null,null,null,null,null,null,"",null,null,null,null,null,null,null,null,null,null,null,null,null,""]
[]
[null,"Use this tab to record activity and emissions data for Waste sources. Emission factors should be recorded in the 'Emission factors' tab.",null,null,null,null,null,"Convert activity data units",null,null,null,null,null,"View emission factor(s)",null,null,null,null,null,null,"Enter emissions data",null,null,null,null,null,null,null,null,null,null,null,null,null,"Data quality explanation (optional)"]
[]
[null,"III.1 SOLID WASTE DISPOSAL"]
{"$rows_left_out":58}
{"sheet":"IV - IPPU","index":8,"n_rows":23,"n_cols":60,"rows_kept":23,"cut":false,"hidden":false,"merged":[[3,12,4,12],[7,13,7,34],[15,13,15,34],[1,57,1,58],[3,57,4,58],[3,35,4,35],[7,35,8,35],[7,36,7,44],[7,57,8,57],[7,58,8,58],[15,57,16,57],[15,58,16,58],[7,12,8,12],[15,12,16,12],[15,45,15,53],[15,54,15,55],[7,11,8,11],[15,11,16,11],[1,6,1,7],[3,6,4,7],[7,8,7,10],[15,8,15,10],[7,1,8,1],[7,2,8,2],[7,3,7,4],[7,5,8,5],[7,6,7,7],[15,1,16,1],[15,2,16,2],[15,3,15,4],[15,5,16,5],[15,6,15,7],[15,56,16,56],[7,54,7,55],[7,56,8,56],[7,45,7,53],[15,35,16,35],[15,36,15,44]]}
[]
[null,"IV INDUSTRIAL PROCESSES AND PRODUCT USE (IPPU)",null,null,null,null,"",null,null,null,null,null,"",null,null,null,null,null,null,null,null,null,null,null,null,null,null,null,null,null,null,null,null,null,null,"",null,null,null,null,null,null,null,null,null,null,null,null,null,null,null,null,null,null,null,null,null,""]
[]
[null,"Use this tab to record activity and emissions data for IPPU sources. This is required for BASIC+ only. Emission factors should be recorded in the 'Emission factors' tab.",null,null,null,null,"Convert activity data units",null,null,null,null,null,"View emission factor(s)",null,null,null,null,null,null,null,null,null,null,null,null,null,null,null,null,null,null,null,null,null,null,"Enter emissions data",null,null,null,null,null,null,null,null,null,null,null,null,null,null,null,null,null,null,null,null,null,"Data quality explanation (optional)"]
[]
[null,"IV.1 INDUSTRIAL PROCESSES"]
{"$rows_left_out":18}
{"sheet":"V - AFOLU","index":9,"n_rows":30,"n_cols":35,"rows_kept":30,"cut":false,"hidden":false,"merged":[[7,11,8,11],[15,11,16,11],[23,11,24,11],[1,33,1,34],[3,33,4,34],[3,12,4,12],[3,19,4,19],[7,13,7,18],[7,19,8,19],[7,20,7,24],[7,32,8,32],[7,33,8,33],[7,34,8,34],[15,33,16,33],[15,34,16,34],[23,33,24,33],[1,6,1,7],[3,6,4,7],[7,8,7,10],[15,8,15,10],[23,8,23,10],[7,1,8,1],[7,2,8,2],[7,3,7,4],[7,5,8,5],[7,6,7,7],[23,19,24,19],[23,20,23,24],[15,1,16,1],[15,2,16,2],[23,1,24,1],[23,2,24,2],[23,3,23,4],[23,5,24,5],[23,6,23,7],[15,3,15,4],[15,5,16,5],[15,6,15,7],[23,34,24,34],[7,12,8,12],[15,12,16,12],[23,12,24,12],[15,25,15,29],[15,30,15,31],[15,32,16,32],[23,32,24,32],[7,25,7,29],[7,30,7,31],[23,25,23,29],[23,30,23,31],[15,13,15,18],[15,19,16,19],[15,20,15,24],[23,13,23,18]]}
[]
[null,"V. AFOLU",null,null,null,null,"",null,null,null,null,null,"",null,null,null,null,null,null,"",null,null,null,null,null,null,null,null,null,null,null,null,null,""]
[]
[null,"Use this tab to record activity and emissions data for AFOLU sources. This is required for BASIC+ only. Emission factors should be recorded in the 'Emission factors' tab.",null,null,null,null,"Convert activity data units",null,null,null,null,null,"View emission factor(s)",null,null,null,null,null,null,"Enter emissions data",null,null,null,null,null,null,null,null,null,null,null,null,null,"Data quality explanation (optional)"]
[]
[null,"V.1 LIVESTOCK"]
{"$rows_left_out":25}
{"sheet":"VI - Other scope 3","index":10,"n_rows":14,"n_cols":59,"rows_kept":14,"cut":false,"hidden":false,"merged":[[3,12,4,12],[3,35,4,35],[7,45,7,53],[7,13,7,34],[1,57,1,58],[3,57,4,58],[7,57,8,57],[7,58,8,58],[7,12,8,12],[7,36,7,44],[7,54,7,55],[7,56,8,56],[7,35,8,35],[3,16,4,16],[1,6,1,7],[3,6,4,7],[7,8,7,10],[7,11,8,11],[7,1,8,1],[7,2,8,2],[7,3,7,4],[7,5,8,5],[7,6,7,7]]}
[]
[null,"VI. OTHER SCOPE 3",null,null,null,null,"",null,null,null,null,null,"",null,null,null,"",null,null,null,null,null,null,null,null,null,null,null,null,null,null,null,null,null,null,"",null,null,null,null,null,null,null,null,null,null,null,null,null,null,null,null,null,null,null,null,null,""]
[]
[null,"Use this tab to record activity and emissions data for Other scope 3 sources. This sector is optional. Emission factors should be recorded in the 'Emission factors' tab.",null,null,null,null,"Convert activity data units",null,null,null,null,null,"View emission factor(s)",null,null,null,"F-gases",null,null,null,null,null,null,null,null,null,null,null,null,null,null,null,null,null,null,"Enter emissions data",null,null,null,null,null,null,null,null,null,null,null,null,null,null,null,null,null,null,null,null,null,"Data quality explanation (optional)"]
[]
[null,"VI.1 OTHER SCOPE 3"]
{"$rows_left_out":9}
{"sheet":"Table A. Overview","index":11,"n_rows":87,"n_cols":15,"rows_kept":87,"cut":false,"hidden":false,"merged":[[7,14,8,14],[7,1,8,1],[7,2,8,2],[7,3,8,3],[7,5,7,13],[7,4,8,4]]}
[]
[null,"GPC GHG Overview"]
[]
[null,"NAME OF CITY:",null,{"$f":"IF('City information'!C10=\"\",'City information'!C9,CONCATENATE('City information'!C9,\", \",'City information'!C10))","v":"Chicago, USA"}]
[null,"BOUNDARY:",null,{"$f":"'City information'!C12","v":"Administrative boundary of a local government "}]
[null,"INVENTORY YEAR:",null,{"$f":"'City information'!C11","v":2010}]
{"$rows_left_out":82}
{"sheet":"Graphs","index":12,"n_rows":0,"n_cols":0,"rows_kept":0,"cut":false,"hidden":true,"merged":[]}

{"sheet":"Table B. Summary","index":13,"n_rows":109,"n_cols":19,"rows_kept":109,"cut":false,"hidden":false,"merged":[[3,13,4,13],[19,6,19,9],[7,1,8,3],[9,1,10,2],[11,1,11,2],[12,1,13,2],[14,1,14,2],[7,4,7,9],[7,10,7,12],[53,2,53,3],[58,2,58,3],[15,1,15,2],[16,1,16,2],[17,1,17,3],[19,1,20,1],[19,2,20,5],[31,2,31,5],[21,2,21,3],[32,2,32,3],[39,2,39,3],[49,2,49,3],[65,1,65,9],[66,1,66,9],[79,1,79,9],[102,2,102,9],[104,1,104,9]]}
[]
[null,"GPC GHG Summary Tables",null,null,null,null,null,null,null,{"$f":"(IFERROR(IF('City information'!C25=\"BASIC\",\"BASIC \",IF('City information'!C25=\"BASIC+\",\"BASIC+ \",\"\")),\"\"))","v":"BASIC "},null,null,null,""]
[]
[null,"NAME OF CITY:",null,{"$f":"IF('City information'!C10=\"\",'City information'!C9,CONCATENATE('City information'!C9,\", \",'City information'!C10))","v":"Chicago, USA"},null,null,null,"POPULATION:",null,{"$f":"'City information'!C14","v":2695598},null,null,null,"Net emissions"]
[null,"BOUNDARY:",null,{"$f":"'City information'!C12","v":"Administrative boundary of a local government "},null,null,null,"LAND AREA (km2):",null,{"$f":"'City information'!C13","v":0}]
[null,"INVENTORY YEAR:",null,{"$f":"'City information'!C11","v":2010},null,null,null,"GDP (US$ bn):",null,{"$f":"'City information'!C15/1000000000","v":0}]
{"$rows_left_out":104}
{"sheet":"Lists","index":14,"n_rows":47,"n_cols":56,"rows_kept":47,"cut":false,"hidden":false,"merged":[[0,11,0,13],[0,52,0,54],[0,0,0,2],[0,41,0,44],[0,31,0,40],[0,45,0,50],[0,22,0,30],[0,14,0,21],[0,3,0,6]]}
["CITY INFORMATION","CITY INFORMATION",null,"INVENTORY INFORMATION",null,null,null,"EMISSION FACTORS",null,null,"NOTATION KEYS","SECTOR TABS","CITY INFORMATION",null,"STATIONARY ENERGY",null,null,null,null,null,null,null,"TRANSPORT",null,null,null,null,null,null,null,null,"WASTE",null,null,null,null,null,null,null,null,null,"IPPU",null,null,null,"AFOLU",null,null,null,null,null,"OTHER SCOPE 3","DATA SOURCES",null,null,"EMISSIONS"]
["Boundary","Economy","Climate","GPC","Gases","GWP","Audit","GPW","Type","Mass units","Notation keys","Data quality","Multiplier","Gases","Stationary","Grid","Energy Industries","1.A.1.a","Fugitive_Coal","1.B.1","Fugitive_Oil_Gas","1.B.2","Method","Road","1.A.3.B","Rail","1.A.3.C","Water","1.A.3.D","Air","1.A.3.A","Solid waste disposal","4.A","Biological treatment of solid waste","4.B","Incineration and open burning of waste","4.C","Wastewater treatment and discharge","4.D","Waste types","Organic waste types","Industrial processes","2.A, 2.B, 2.C","Product use","2.D, 2.E, 2.F, 2.G","Livestock","3.A","Land","3.B","Aggregate sources","3.C and 3.D","Scope 3","Reporting Period","Frequency","Scale","Data"]
[null,null,null,null,null,null,null,null,null,null,null,null,null,null,null,null,null,null,null,null,null,null,null,null,null,null,null,null,null,null,null,null,null,null,null," "]
["Please select","Please select","Please select","Please select","Please select","Please select","Please select","Please select","Please select","Please select","NO","L",1000000,"CO2","Please select","Please select","Please select",null,"Please select",null,"Please select",null,"Please select","Please select",null,"Please select",null,"Please select",null,"Please select",null,"Please select",null,"Please select",null,"Please select",null,"Please select",null,"Please select","Please select","Please select",null,"Please select","2.D, 2.E, 2.F, 2.G","Please select",null,"Please select",null,"Please select",null,"Please select","Please select","Please select","Please select","✓"]
["Administrative boundary of a local government ","Industry & Manufacturing","Tropical rainforest","BASIC","CO2","IPCC Fifth Assessment Report (2013)","Yes - audited","5AR","CO2e","g","IE","M",100000,"CH4","Gas (natural gas)","Electricity","Electricity generation","1.A.1.a.i","All activities","1.B.1","All activities","1.B.2","Fuel sales approach","Compressed natural gas (CNG)",null,"Diesel oil",null,"Compressed natural gas (CNG)",null,"Aviation gasoline",null,"Landfill sites - Methane commitment","4.A.1","All organic waste",null,"Open burning of waste","4.C.1","All wastewater","4.D","All waste","All organic waste","All industrial processes","2.A, 2.B, 2.C","All product use","2.D","All livestock","3.A","All land","3.B","Burning","3.C.1","Goods and services","Calendar year","Annual","Local"]
["Combination of administrative divisions","Services","Tropical monsoon","BASIC+","CO2, CH4, N2O","IPCC Fourth Assessment Report (2007)","Yes - verified","4AR","GHG","kg","NE","H",10000,"N2O","Compressed natural gas (CNG)","Electricity (CHP)","Combined heat and power generation (CHP)","1.A.1.a.ii","Coal mining and handling","1.B.1.a","Oil","1.B.2.a","City-induced activity","Gas oil ",null,"Electricity",null,"Gas oil ",null,"Jet gasoline",null,"Landfill sites - First order decay","4.A.1","Composting",null,"Waste incineration","4.C.2","Domestic wastewater","4.D.1","Municipal solid waste","Food waste","Mineral industry","2.A","Non-energy products from fuels and solvent use","2.D","Cattle","3.A.1.a/3.A.2.a","Forest land","3.B.1","  Burning in Forest land","3.C.1.a","Food","Financial year","Every 2 years","Metro"]
{"$rows_left_out":41}